{"text_format":"1","workbook":"xlsx","n_sheets":6,"sheets":["Intro","Cap.Goods","BUDGET","Bayes","Staff","Bayes5"],"not_rendered":{"charts":2,"images":81,"macros":1,"external_links":3,"defined_names":60,"comments":4,"pivot_tables":0},"unopened":[],"bounds":{"document_bytes":16777216,"sheet_cells":100000,"rows_first":2000,"rows_last":500,"rows_between":2000,"halvings":0,"cell_chars":16384,"cell_head_chars":4096},"cells_cut":0,"cells_raw":0,"read":"whole","date_system":"1900"}

{"sheet":"Intro","index":0,"n_rows":98,"n_cols":23,"rows_kept":98,"cut":false,"hidden":false,"merged":[[28,2,28,4],[21,2,21,3],[10,0,10,1],[12,2,13,3],[22,0,22,1],[23,2,23,4],[0,19,0,21],[6,20,6,21],[2,16,4,16],[5,15,6,17],[1,15,1,17],[12,19,12,20],[9,6,9,7],[31,21,32,21],[30,6,30,7],[30,14,30,15],[30,10,30,11],[30,8,30,9],[27,10,27,11],[14,16,18,16],[21,10,21,11],[25,10,25,11],[23,10,23,11],[15,5,16,7],[14,11,14,12],[19,10,19,11],[95,5,95,6],[80,5,80,6],[65,1,65,2],[48,8,48,9],[47,6,61,6],[60,8,60,9],[61,8,61,9],[49,7,49,9],[56,7,56,9],[59,8,59,9],[53,7,53,9],[64,5,64,6],[51,8,52,8],[90,2,91,2],[55,15,55,16],[44,0,45,0],[29,10,29,11],[30,12,30,13],[46,15,46,17],[29,12,29,13],[29,14,29,15],[30,0,30,2],[29,8,29,9],[29,6,29,7],[46,7,46,9],[44,1,44,4],[42,2,42,3],[54,8,55,8],[0,2,0,4],[22,2,22,4],[10,6,10,7],[11,6,11,7],[10,13,11,15],[13,7,14,8],[3,5,3,6],[4,5,4,6],[4,7,5,11],[7,12,7,15],[20,1,20,2],[6,0,7,1]]}
[0,null,"Alternative Evaluation",null,null,null,null,null,null,null,null,null,null,null,null,null,null,"Do you need free browsing the program file?",null,"          Exchange Rates"]
[null,null,null,"EXPECTED FINAL RESULT OF PRE DESIGN ",null,null,null,null,null,null,null,null,null,null,null,"Click down",null,null,null,1,1.96,{"$f":"V3/T3","v":1.2195121951219512}]
[null,null,"            SALES, Loan Life",{"$f":"SUM(D4:D7)","v":19496400},{"$f":"SUM(E4:E7)","v":38212944},null,null,null,null,null,null,null,null,null,null,null,null,null,null,0.82,null,1]
[null,null,"          Tomatoes (T )",{"$f":"ROUND(Q22,-2)","v":14387800},{"$f":"D4*$U$2","v":28200088},"    BROWSING",null,"    Represented by local outsourcing east electric company Ltd., Bulgaria "]
[null,null,"          Cucumbers (C )",{"$f":"ROUND(Q24,-2)","v":5108600},{"$f":"D5*$U$2","v":10012856},"    OPERATIONS ",null,"TomCuc Greenhouse"]
[null,null,"            By/3th products",{"$f":"H26+J26+L26+N26+P26+T26","v":0},{"$f":"D6*$U$2","v":0},null,null,null,null,null,null,null,null,null,null,{"$f":"TODAY()","v":"2019-01-01"}]
[" Click the picture \u0093 to increase it",null,"         Market Products",{"$f":"Q28","v":0},{"$f":"D7*$U$2","v":0},null,"    ←Level 5    →",null,"Zoom↓","Risk assessment and management Go to Bayes Theorem"]
[null,null,"           COSTS, Total",{"$f":"SUM(D9:D10)","v":6891015.5692759175},{"$f":"SUM(E9:E10)","v":13506390.515780799},null,"        ←Level 4   →",null,null,"Sensitivity analysis",null,null,"              ←Zoom 100  PC screen resolution: 1920 x 1080"]
[null,null,"        Variable costs",{"$f":"BUDGET!C23","v":4241086.8922391087},{"$f":"D9*$U$2","v":8312530.3087886525},null,"           ←Level 3",null,null," Resolution 1680 x 1050. For lower PC screen resolution try this → "]
["  T","           C","         Fixed costs",{"$f":"BUDGET!C24","v":2649928.6770368093},{"$f":"D10*$U$2","v":5193860.2069921456},null," ←Level 2",null,"Zoom 143","Cash-flow Pro-forma Budgeting ",null,null,null," 1920 x 1080"]
["    By-products",null,"         Revenues /Costs",{"$f":"ROUND(D3-D8,-3)","v":12605000},{"$f":"ROUND(E3-E8,-3)","v":24707000},null,"        ←Level 1",null,"→","Capital Goods and Services         ",null,null,null,"Select Zoom 100 if Resolution of your display is lesser than 1600 x 900."]
[null,null,"         Marketing / RM",{"$f":"BUDGET!C25","v":138385.35116653651},{"$f":"D12*$U$2","v":271235.28828641155},null,"              ←Level 0",null,"Basic data, invariant for this Project"]
[null,null,"From market Bad,  is selected over underground water resource Increase / Decrease ",null,{"$f":"E5*(1-E15)","v":11574494.091743119}]
["Efficiency of selling own products",null,null,null,{"$f":"E13*(1+E16)","v":15553226.435779816},null,null,"   Level        Go dowm"]
["Increased sale of final products",null,109,92,{"$f":"(D15-C15)/C15","v":-0.15596330275229359},null,null,null,null,null,null,"Quality Evaluation",null,{"$f":"U38/M16","v":678.9285000000001},"t p.a./ 1 ha","relative yield","Demand increases"]
["       Increased the sale price, €",null,3.2,4.3,{"$f":"(D16-C16)/C16","v":0.34374999999999989}," \u0085 Click the image  to reveal the final results",null,null,null,null,null,"Area ",{"$f":"5898000/1000000","v":5.8979999999999997},{"$f":"M16*N17","v":4140.3960000000006},"t p.a. Project"]
[null,null,null,null,{"$f":"E13/E14","v":0.7441860465116279},null,null,null,null,null,"T≈",0.7,{"$f":"M16*L17","v":4.1285999999999996},{"$f":"U36/M17","v":702.00000000000011},"t p.a./ 1 ha","Max size:"]
["          Overall probability of Bad event - lost profits due to the wholesalers distribution.",null,null,null,null,null,null,null,null,null,"C≈",{"$f":"100%-L17","v":0.30000000000000004},{"$f":"M16*L18","v":1.7694000000000001},{"$f":"U37/M18","v":625.09500000000025},"t p.a./ 1 ha",13.2384,null,null,null,{"$f":"13.81*2","v":27.62}]
[null,null,null,null,"Revenue increase due to better distribution, TOTAL:","7-Yr Option","FINAL PRODUCTS FOR SALE",null,null,null,"Other≈",{"$f":"100%-L17-L18","v":0},{"$f":"M16*L19","v":0},null,null,null,null,null,null,{"$f":"14.33*2","v":28.66}]
[null,"     The  greenhouse complex",null,null,"Loans A + B - D Investment, TOTAL:","Sales  Nr of Yrs:",null,null,null,{"$f":"BUDGET!G41","v":1},"  2,              3,",null,null,{"$f":"BUDGET!M41","v":4},null,{"$f":"BUDGET!O41","v":5},null,null,null,{"$f":"SUM(T18:T19)","v":56.28}]
["Creditor ECA \u0086","    Project Finance",null,null,{"$f":"Bayes!P21/100","v":2.0999999999999998E-2},"Products","t p.a.","Total, €","t p.a.","Total, €",null,null,"t p.a.","Total, €","t p.a.","Total, €","Check"]
["  Export Credit Insurance ",null,"            Financial Modeling",null,{"$f":"E14*(1-E21)","v":15226608.680628439},"Tomatoes  T",{"$f":"U36","v":2898.2772},{"$f":"U39","v":2877551.6754789003},{"$f":"U36","v":2898.2772},{"$f":"U39","v":2877551.6754789003},". . . . . .",null,{"$f":"U36","v":2898.2772},{"$f":"U39","v":2877551.6754789003},{"$f":"U36","v":2898.2772},{"$f":"U39","v":2877551.6754789003},{"$f":"P22*P20","v":14387758.377394501}]
["                        Marketing",null,"              Business Plan \u0085  East Electric Company",null,null,"Outcome:"]
[null,null,"           Risk Assessment \u0085   Equivalence Ltd.\u0086",null,null,"Cucumbers C",{"$f":"U37","v":1106.0430930000005},{"$f":"U40","v":1021725.6185908801},{"$f":"U37","v":1106.0430930000005},{"$f":"U40","v":1021725.6185908801},". . . . . .",null,{"$f":"U37","v":1106.0430930000005},{"$f":"U40","v":1021725.6185908801},{"$f":"U37","v":1106.0430930000005},{"$f":"U40","v":1021725.6185908801},{"$f":"P24*P20","v":5108628.0929544}]
[null,null,null,"Greenhouse platform construction",null,"Outcome:"]
[null,null,null,"& infrastructure, power connection",null,"By-products",null,null,null,null,". . . . . .",null,null,null,null,null,{"$f":"P26*P20","v":0}]
[null,null,null,"            \u0087   Construction company",null,"2ndstage of project"]
["  Products:",null,null,"      Intellectual products:",null,"Others, fromarket",null,{"$f":"BUDGET!G49+BUDGET!H49","v":0.5},null,{"$f":"BUDGET!I49+BUDGET!J49","v":800},". . . . . .",null,null,{"$f":"BUDGET!N49+BUDGET!O49","v":0},null,{"$f":"BUDGET!P49+BUDGET!Q49","v":0},{"$f":"O28*P20","v":0}]
["                        Cucumbers ←",null,"                ← Risk assessment & management",null,null,"Outcome:"]
["                  Tomatoes  ←",null,null,"← Online cash-flow control system ",null,"Budget, TOTAL",{"$f":"H22+H24+H26+H28","v":3899277.7940697805},null,{"$f":"J22+J24+J26+J28","v":3900077.2940697805},null,". . . . . .",null,{"$f":"N22+N24+N26+N28","v":3899277.2940697805},null,{"$f":"P22+P24+P26+O28","v":3899277.2940697805},null,{"$f":"Q22+Q24+Q26+Q28","v":19496386.470348902}]
[" By-products of tomatoes & cucumbers  ←",null,null,"← History of sales and costs ",null,"Outcome, TOTAL",{"$f":"H23+H25+H27+H29","v":0},null,{"$f":"J23+J25+J27+J29","v":0},null,{"$f":"L23+L25+L27+L29","v":0},null,{"$f":"N23+N25+N27+N29","v":0},null,{"$f":"P23+P25+P27+P29","v":0}]
["The applied color and image visualizations in all worksheets are designed for faster and easier perception of the figures and formulas, as well as for their long term remembering for project financing success.",null,null,null,null,null,null,null,null,null,null,null,null,null,null,null,null,null,null,null,"¯ Basic unchangeable values for transfer to upper level Ö","Average"]
[null,null,null,null,null,null,null,"Sales    Mo:",1,{"$f":"I33+1","v":2},{"$f":"J33+1","v":3},4,5,6,7,8,9,10,11,12,"Total/Average"]
[null,null,null,null,null,null,null,"SingleT Price,€/kg",{"$f":"C50","v":1.6442999999999999},{"$f":"C51","v":2.6892},{"$f":"C52","v":2.0898000000000003},{"$f":"C53","v":1.5066000000000002},{"$f":"C54","v":1.1421000000000001},{"$f":"C55","v":0.7128000000000001},{"$f":"C56","v":0.59887350000000017},{"$f":"C57","v":0.54270000000000007},{"$f":"C58","v":0.7128000000000001},{"$f":"C59","v":1.4256000000000002},{"$f":"C60","v":1.0935000000000001},{"$f":"C61","v":1.4256000000000002},{"$f":"SUM(I34:T34)/12","v":1.2986561249999999},"/kg"]
[null,null,null,null,null,null,null,"SingleC  Price, €/kg",{"$f":"F50","v":1.3440000000000001},{"$f":"F51","v":1.1927999999999999},{"$f":"F52","v":1.3524},{"$f":"F53","v":1.4531999999999998},{"$f":"F54","v":1.0247999999999999},{"$f":"F55","v":0.66359999999999997},{"$f":"F56","v":0.51239999999999997},{"$f":"F57","v":0.64680000000000004},{"$f":"F58","v":1.2431999999999999},{"$f":"F59","v":0.84},{"$f":"F60","v":1.8480000000000001},{"$f":"F61","v":0.74759999999999993},{"$f":"SUM(I35:T35)/12","v":1.0724},"/kg"]
[null,null,null,null,null,null,null,"This caseT yield,kg",{"$f":"A50*$M$17*10000","v":0},{"$f":"A51*$M$17*10000","v":0},{"$f":"A52*10000*$M$17","v":181658.4},{"$f":"A53*$M$17*10000","v":355059.59999999992},{"$f":"A54*$M$17*10000","v":400474.19999999995},{"$f":"A55*$M$17*10000","v":425245.8},{"$f":"A56*$M$17*10000","v":450017.39999999997},{"$f":"A57*$M$17*10000","v":404602.8},{"$f":"A58*$M$17*10000","v":309645},{"$f":"A59*$M$17*10000","v":194044.19999999998},{"$f":"A60*$M$17*10000","v":111472.2},{"$f":"A61*$M$17*10000","v":66057.600000000006},{"$f":"SUM(I36:T36)/1000","v":2898.2772},"/ha"]
[null,null,null,null,null,null,null,"This case C yield,kg",{"$f":"D50*M18*10000","v":0},{"$f":"D51*$M$18*10000","v":61829.913600000007},{"$f":"D52*10000*$M$18","v":111327.10920000001},{"$f":"D53*$M$18*10000","v":131025.83940000001},{"$f":"D54*$M$18*10000","v":42646.07880000001},{"$f":"D55*$M$18*10000","v":189423.117},{"$f":"D56*$M$18*10000","v":201531.12119999999},{"$f":"D57*$M$18*10000","v":177465.51180000001},{"$f":"D58*$M$18*10000","v":21420.356400000001},{"$f":"D59*$M$18*10000","v":88866.345600000015},{"$f":"D60*$M$18*10000","v":52790.049000000006},{"$f":"D61*$M$18*10000","v":27717.651000000002},{"$f":"SUM(I37:T37)/1000","v":1106.0430930000005},"/ha"]
[null,null,null,null,null,null,null,"This TOTAL YIELD",{"$f":"I36+I37","v":0},61829.913600000007,{"$f":"K36+K37","v":292985.50919999997},{"$f":"L36+L37","v":486085.43939999992},443120.27879999997,{"$f":"N36+N37","v":614668.91700000002},651548.52119999996,582068.31180000002,331065.35639999999,282910.54560000001,164262.24900000001,93775.251000000004,{"$f":"SUM(U36:U37)","v":4004.3202930000007},{"$f":"IF(SUM(I38:T38)/1000=U38,TRUE,FALSE)","v":true}]
[null,null,null,null,null,null,null,"This caseTsales, €\u0081",{"$f":"I36*I34","v":0},0,{"$f":"K36*K34","v":379629.72432000004},534932.79335999989,457381.58382,303115.20624000003,{"$f":"O36*O34","v":269503.49539890006},219577.93956000003,220714.95600000003,276629.41152000002,121894.85070000001,94171.714560000022,{"$f":"SUM(I39:T39)","v":2877551.6754789003},"/ann"]
[null,null,null,null,null,null,null,"This caseC sales, €\u0081",{"$f":"I37*I35","v":0},{"$f":"J37*J35","v":73750.720942080006},{"$f":"K37*K35","v":150558.78248208002},{"$f":"L37*L35","v":190406.74981608},{"$f":"M37*M35","v":43703.701554240004},{"$f":"N37*N35","v":125701.18044119999},103264.54650288,114784.69303224001,26629.787076479999,74647.730304000012,97556.010552000022,20721.715887599999,{"$f":"SUM(I40:T40)","v":1021725.6185908801},"/ann"]
[null,null,null,null,null,null,null,"Costs     ↓",null,null,null,null,null,null,null,null,null,null,null,"Sales:",{"$f":"SUM(U39:U40)","v":3899277.2940697805},"/ann"]
[null,null,null,null,null,null,null,"Pell+Trans.Heating",{"$f":"N66","v":40552.194247687505},{"$f":"N67","v":36865.688790562497},{"$f":"N68","v":31324.303250812496},{"$f":"N69","v":23962.708284187498},{"$f":"N70","v":10994.4736574375},{"$f":"N71","v":0},{"$f":"N72","v":0},{"$f":"N73","v":0},{"$f":"N74","v":0},{"$f":"N75","v":18432.809160875},{"$f":"N76","v":27649.213741312502},{"$f":"N77","v":31335.789667249996},{"$f":"SUM(I42:T42)","v":221117.18080012503},"/ann"]
[null,null,"     For Developer's use only",null,null,null,null,"This Packaging",{"$f":"I36*$G$68+I37*$G$71","v":0},2782.3461120000002,16817.515914,28975.036772999996,27949.896545999996,36165.017265000002,38320.031453999996,34285.130031000001,21090.841037999999,16611.858552000002,9621.2452050000011,5541.0382950000003,{"$f":"SUM(I43:T43)","v":238159.95718500004},"/ann"]
[null,null,null,null,null,null,null,"This Running cost",null,null,null,null,null,null,null,null,null,null,null,null,{"$f":"SUM(I44:T44)","v":0},"/ann"]
[" Tom.","                 I N F L O W   D A T A   W O R K I N G   P A N E L ",null,null,null,null,null,"Others fromarket",null,null,null,null,null,null,null,null,null,null,null,null,null,"/ann"]
[null,null,"DATA ENTRY PANEL FOR THE BASE Level 0",null,null,null,null,null,null,null,null,null,null,null,null,null,null,null,null,"     I  N  C  R  E  A  S  E  :","Æ  VAT","Æ Own Funds","Prc OwnFunds"]
["↑ Increase","C %+4%","          Potential YIELD and\n","SALES",null,null,null,"COSTS of fertilizer, seeding and substrate",null,null,"Water p.a.","Consumption","Electricity","This","Project","Budgeted values + VAT revivable",null,null,{"$f":"S48+S56","v":8542843.9434029851},{"$f":"M16","v":5.8979999999999997},{"$f":"U48+U56","v":8344843.9434029851},{"$f":"V48+V56","v":{"$error":"#REF!"}},{"$f":"V47*T57","v":{"$error":"#REF!"}}]
["price option"," Price",{"$f":"-IF(D49=0,0,(D49+3)/100)","v":-0.19}," Yield C  kg/m2","Price    ↑",{"$f":"-D49/100","v":-0.16},"These data are based on the EU FSS ",13.4,"←Total area as base",null,5,"liter p.m2",6,"Water +","Electricity","Local Costs","     ↓",1,{"$f":"SUM(S50:S55)+S64","v":871967.94340298511},"VAT",{"$f":"SUM(U49:U55)","v":1173967.9434029851},{"$f":"SUM(V49:V55)","v":1173967.9434029851},{"$f":"SUM(W49:W55)","v":1165082}]
[" Yield T  kg/m2","   ↑   € /kg","€ /kg ",16,"€ /kg ",null,null,"  This project   ↓","               €/ Yr/ ha",null,0.3," € p. liter",0.06,null,"↓","Permits & Construction, F26",null,null,50000,0,{"$f":"S50*(1+$T$49)","v":302000},{"$f":"U49*(1+T$60)","v":302000},{"$f":"V49*(1-$T$57)","v":302000}]
[0,2.0299999999999998,{"$f":"B50*(1+$C$48)","v":1.6442999999999999},0,1.6,{"$f":"E50*(1+$F$48)","v":1.3440000000000001},null,"↓     Fertilizers      ↓               .",null,null,0.218,{"$f":"$K$48*$K$49*$T$47*K50*10000","v":19286.46},{"$f":"K50*$M$48*$M$49*$T$47*10000","v":4628.7503999999999},null,null,"Terrain, infrastructure, F27",null,4.4999999999999998E-2,{"$f":"ROUNDUP(R50*S57,-3)","v":302000},"TOTAL",{"$f":"S50*(1+$T$49)","v":302000},{"$f":"U50*(1+T$60)","v":302000},{"$f":"V50*(1-$T$57)","v":302000}]
[0,3.32,{"$f":"B51*(1+$C$48)","v":2.6892},{"$f":"34944/10000","v":3.4944000000000002},1.42,{"$f":"E51*(1+$F$48)","v":1.1927999999999999},null,{"$f":"I83","v":113440},-0.05,{"$f":"I52/$H$48","v":8042.3880597014922},0.17499999999999999,{"$f":"$K$48*$K$49*$T$47*K51*10000","v":15482.249999999998},{"$f":"$M$48*$M$49*$T$47*10000*K51","v":3715.74},null,null,"Others unforeseen exp. F29",null,9000,{"$f":"R51*$T$47","v":53082},{"$f":"U47-S47","v":-198000},{"$f":"S51*(1+$T$49)","v":53082},{"$f":"U51*(1+T$60)","v":53082},{"$f":"V51*(1-$T$57)","v":53082}]
[4.4000000000000004,2.58,{"$f":"B52*(1+$C$48)","v":2.0898000000000003},{"$f":"62918/10000","v":6.2918000000000003},1.61,{"$f":"E52*(1+$F$48)","v":1.3524},null,{"$f":"$J$51*M17","v":33203.80334328358},{"$f":"H51*(1+I51)","v":107768},null,0.14099999999999999,{"$f":"$K$48*$K$49*$T$47*K52*10000","v":12474.269999999999},2993.8247999999994,null,null,"Truck transport, F31",null,{"$f":"IF($T$47>10,A93,IF($T$47<=5,25000,35000))","v":35000},0,"Local cost",{"$f":"S52*(1+$T$49)","v":0},0,{"$f":"V52*(1-$T$57)","v":0}]
[8.6,1.86,{"$f":"B53*(1+$C$48)","v":1.5066000000000002},{"$f":"74051/10000","v":7.4051},1.73,{"$f":"E53*(1+$F$48)","v":1.4531999999999998},null,{"$f":"J51*M18","v":14230.201432835822},null,null,6.4000000000000001E-2,{"$f":"$K$48*$K$49*$T$47*10000*K53","v":5662.08},1358.8992000000001,null,null,"BizPlan, Fin. modeling, F33",null,{"$f":"IF($T$47>10,300000,IF($T$47<=5,80000,240000))","v":240000},{"$f":"R53","v":240000},"Exp-Imp",{"$f":"S53*(1+$T$49)","v":240000},240000,{"$f":"V63*(1-$T$57)","v":240000}]
[9.6999999999999993,1.41,{"$f":"B54*(1+$C$48)","v":1.1421000000000001},{"$f":"24102/10000","v":2.4102000000000001},1.22,1.0247999999999999,null,"↓     Seeding          ↓             .",null,null,0.01,884.7,212.328,"6 Mo","SubTOTAL","Risk Assessment, F34",null,{"$f":"IF($T$47>10,60000,IF($T$47<=5,20000,28000))","v":28000},{"$f":"R54","v":28000},59572.800000000003,28000,28000,{"$f":"V53*(1-$T$57)","v":240000}]
[10.3,0.88,0.7128000000000001,{"$f":"107055/10000","v":10.705500000000001},0.79,0.66359999999999997,null,{"$f":"I84","v":275200},{"$f":"H55*(1+I51)","v":261440},{"$f":"I55/$H$48","v":19510.447761194031},0.01,{"$f":"$K$48*$K$49*$T$47*10000*K55","v":884.7},212.328,"1 →",{"$f":"SUM(L50:L55)+SUM(M50:M55)","v":67796.330399999992},"Plants' mater's, seeding, F30",null,{"$f":"J51+J55+J58","v":42640.820895522389},{"$f":"R55*C83","v":248885.94340298508},null,{"$f":"S55*(1+$T$49)","v":248885.94340298508},248885.94340298508,{"$f":"V54*(1-$T$57)","v":28000}]
[10.9,0.73935000000000017,0.59887350000000017,{"$f":"113898/10000","v":11.389799999999999},0.61,0.51239999999999997,null,{"$f":"J55*$T$47","v":115072.62089552238},null,null,0,0,0,null,null," Greenhouse Import ↓",null,null,{"$f":"SUM(S57:S63)","v":7670876},"OwnFunds",{"$f":"SUM(U57:U63)","v":7170876},{"$f":"SUM(V57:V63)","v":{"$error":"#REF!"}},{"$f":"SUM(W58:W62)","v":{"$error":"#REF!"}}]
[9.8000000000000007,0.67,0.54270000000000007,{"$f":"100297/10000","v":10.0297},0.77,0.64680000000000004,null,"Biennially    ↓    Substrate    ↓  Biennially",null,null,0,0,0,null,null,"Greenhouse compl. set, F8",null,{"$f":"ROUNDUP(A95,-3)","v":1096000},{"$f":"A89+S63","v":6702076},0,{"$f":"S57*(1+$T$49)","v":6702076},{"$f":"U57*(1+T$60)","v":6702076},{"$f":"V56*(1-$T$57)","v":{"$error":"#REF!"}}]
[7.5,0.88,{"$f":"B58*(1+$C$48)","v":0.7128000000000001},{"$f":"12106/10000","v":1.2105999999999999},1.48,1.2431999999999999,null,{"$f":"I85","v":212820},{"$f":"H58*(1+I51)","v":202179},{"$f":"I58/$H$48","v":15087.985074626866},8.9999999999999993E-3,796.2299999999999,191.09519999999998,null,null,"Construction+installation, F9",null,null,500000,"+",null,{"$f":"U59*(1+T$60)","v":180000},{"$f":"V57*(1-$T$57)","v":6702076}]
[4.7,1.76,{"$f":"B59*(1+$C$48)","v":1.4256000000000002},{"$f":"50224/10000","v":5.0224000000000002},1,0.84,null,{"$f":"J58*$T$47/2","v":44494.467985074625},null,null,6.2E-2,5485.14,1316.4335999999998,null,null,"Truck transport, F",null,{"$f":"A93/T47","v":30518.819938962362},180000,{"$f":"T60-T57","v":0},{"$f":"S59*(1+$T$49)","v":180000},{"$f":"U60*(1+T$60)","v":42000}]
[2.7,1.35,1.0935000000000001,{"$f":"29835/10000","v":2.9834999999999998},2.2000000000000002,1.8480000000000001,null,"q   Biennially   s","s   Biennially   q",null,0.12,{"$f":"$K$48*$K$49*$T$47*10000*K60","v":10616.4},2547.9359999999997,"6 Mo","SubTOTAL","1 Yr Supervision, F10","F10→ 2 ",1,{"$f":"A92*R60","v":42000},{"$f":"((100/(100-T57*100)*100-100)/100)","v":0},{"$f":"S60*(1+$T$49)","v":42000},{"$f":"#REF!*(1+T$60)","v":{"$error":"#REF!"}},{"$f":"V58*(1-$T$57)","v":180000}]
[1.6,1.76,1.4256000000000002,{"$f":"15665/10000","v":1.5665},0.89,0.74759999999999993,null,"TOTAL","TOTAL",null,0.191,16897.77,4055.4647999999997,"2 →",{"$f":"SUM(L56:L61)+SUM(M56:M61)","v":41906.469599999997},"Management.&Training, F10",null,"\u0092",{"$f":"A91","v":6800},"Σ over↓",{"$f":"S61*(1+$T$49)","v":6800},{"$f":"U61*(1+T$60)","v":6800},{"$f":"V60*(1-$T$57)","v":{"$error":"#REF!"}}]
[{"$f":"SUM(A50:A61)","v":70.2},{"$f":"SUM(B50:B61)/12","v":1.603279166666667},{"$f":"SUM(C50:C61)/12","v":1.2986561249999999},{"$f":"SUM(D50:D61)","v":62.509499999999996},{"$f":"SUM(E50:E61)/12","v":1.2766666666666666},{"$f":"SUM(F50:F61)/12","v":1.0724},null,{"$f":"H52+H53+H56+H59","v":207001.0936567164},{"$f":"H52+H53+H56","v":162506.62567164178},null,{"$f":"SUM(K50:K61)","v":1},{"$f":"SUM(L50:L61)","v":88470},{"$f":"SUM(M50:M61)","v":21232.799999999996},null,"←Change↓",null,null,null,null,null,null,null,{"$f":"V61*(1-$T$57)","v":6800}]
["TOTAL","Average",{"$f":"B63","v":"Average"},"TOTAL","Average",{"$f":"E63","v":"Average"},null,null,null,"Pellets  →","Conventional","HEATING","Consumption",0,"Location↑","Risk Assessment software",null,null,240000,null,{"$f":"S63*(1+$T$49)","v":240000},{"$f":"U63*(1+T$60)","v":240000},{"$f":"V59*(1-$T$57)","v":42000}]
[null,"min. Price exWarehouse, LondonÒ",1.2,null,"m",null,null,155,"Tansport →",20,350,{"$f":"K64/J64/1000","v":1.7500000000000002E-2},".+ Transport","This project",null,"Exclusive, F29",{"$f":"IF(N63>0,5.7,0)","v":0},0,{"$f":"Q64*R64","v":0}]
[null,"Ý  Resource:  Nov. 2016",1.35,"Other product","Price in €","                   PACKING",null,"           Pellets  →","kg p.Mo↓","kg p.1ha",{"$f":"H64/1000","v":0.155},"Transp. p.ha","€/Mo/ha","€ p.↓Mo"]
["Spain yiels T + C:","Average price ↓ in Holland",null," Yield ↓  kg/m2","€ /kg ",null,"T",null,575463,{"$f":"I66/13.2","v":43595.681818181823},{"$f":"J66*$K$65*(1+$N$63)","v":6757.3306818181827},{"$f":"K66*$L$64","v":118.25328693181821},{"$f":"K66+L66","v":6875.5839687500011},{"$f":"M66*$T$47","v":40552.194247687505}]
["Kg","Kg/m2","€ /kg ",null,null,10,0.65,null,523149,{"$f":"I67/13.2","v":39632.5},{"$f":"J67*$K$65*(1+$N$63)","v":6143.0375000000004},{"$f":"K67*$L$64","v":107.50315625000002},{"$f":"K67+L67","v":6250.5406562500002},{"$f":"M67*$T$47","v":36865.688790562497}]
[264768,{"$f":"A68/$C$82","v":4.5361842105263159},1.21,null,null,1,{"$f":"G67/F67","v":6.5000000000000002E-2},null,444513,{"$f":"I68/13.2","v":33675.227272727272},{"$f":"J68*$K$65*(1+$N$63)","v":5219.6602272727268},{"$f":"K68*$L$64","v":91.344053977272722},{"$f":"K68+L68","v":5311.0042812499996},{"$f":"M68*$T$47","v":31324.303250812496}]
[728112,12.474506578947368,2.83,"Here ↗","Image of new product",null,"C",null,340047,25761.136363636364,{"$f":"J69*$K$65","v":3992.9761363636362},69.877082386363639,{"$f":"K69+L69","v":4062.85321875},{"$f":"M69*$T$47","v":23962.708284187498}]
[1125264,19.278782894736842,1.85,null,null,10,0.45,null,156019,11819.621212121212,{"$f":"J70*$K$65*(1+$N$63/1.5)","v":1832.0412878787879},32.060722537878789,{"$f":"K70+L70","v":1864.1020104166666},10994.4736574375,null,null,null,null,null,null,null,"iGo to Level"]
[1191456,20.412828947368421,1.33,null,null,1,{"$f":"G70/F70","v":4.4999999999999998E-2},null,0,0,{"$f":"J71*$K$65*(1+$N$63)","v":0},0,{"$f":"K71+L71","v":0},0]
[1059072,18.144736842105264,1.01,null,null,null,null,null,0,0,{"$f":"J72*$K$65*(1+$N$63)","v":0},0,0,0]
[0,0,0.63,null,null,null,null,null,0,0,{"$f":"J73*$K$65*(1+$N$63)","v":0},0,0,0]
[369152,6.3245614035087723,0.53,null,null,null,null,null,0,0,{"$f":"J74*$K$65*(1+$N$63)","v":0},0,0,0]
[595728,10.206414473684211,0.51,null,null,null,null,null,261574,19816.212121212124,{"$f":"J75*$K$65*(1+$N$63/3)","v":3071.5128787878793},53.751475378787894,3125.2643541666671,18432.809160875]
[728112,12.474506578947368,0.63,null,null,null,null,null,392361,29724.318181818184,{"$f":"J76*$K$65*(1+$N$63)","v":4607.2693181818186},80.627213068181831,{"$f":"K76+L76","v":4687.8965312500004},27649.213741312502]
[369152,6.3245614035087723,1.01,null,null,null,null,null,444676,33687.57575757576,{"$f":"J77*$K$65*(1+$N$63)","v":5221.5742424242426},91.377549242424251,5312.9517916666664,31335.789667249996]
[132384,2.268092105263158,0.95,null,null,null,null,null,{"$f":"SUM(I66:I77)/10000","v":313.78019999999998},{"$f":"SUM(J66:J77)","v":237712.27272727271},{"$f":"SUM(K66:K77)","v":36845.402272727275},644.79453977272738,37490.196812499998,{"$f":"SUM(N66:N77)","v":221117.18080012503}]
[264768,4.5361842105263159,1.26,null,null,null,null,null,null,null,null,null,null,"ha"]
[{"$f":"SUM(A68:A79)","v":6827968},{"$f":"SUM(B68:B79)","v":116.98135964912279},"   ↙        OFFERS        ↘",{"$f":"SUM(D68:D79)","v":0},{"$f":"SUM(E68:E79)/12","v":0}]
["① Spain","Polycarbonate","Production + Nursery","②"," Canada          ③","           Netherland–Poland",null,null,"VEGETABLE MATERIALS for",{"$f":"H48","v":13.4}]
[{"$f":"13810*2","v":27620},"Product zones 1+3",58368,"Sector 1",{"$f":"158.15*351","v":55510.65},null,null,"Year",1,{"$f":"I82+1","v":2},{"$f":"J82+1","v":3},4,5,6,7,8]
[{"$f":"14330*2","v":28660},"Product zones 2+4",{"$f":"C82/10000","v":5.8368000000000002},"Sector 2",{"$f":"158.15*351","v":55510.65},null,null,"Fertilizers:",113440,113440,113440,113440,113440,113440,113440,113440]
[2700,"Cenrtral warehouse",null,null,null,null,null,"Seeding:",275200,275200,275200,275200,275200,275200,275200,275200]
[{"$f":"SUM(A82:A84)","v":58980},"Ç   TOTAL surface greenhouse+nursery",null,"Service area",{"$f":"ROUND(28.8*42.25,-1)","v":1220},null,null,"Substrate:",212820,0,212820,0,212820,0,212820,0]
[2246,"Nursery ↑ included",null,"Central coridor",{"$f":"ROUND((3.25*351),-1)","v":1140},null,null,"TOTAL:",{"$f":"SUM(I83:I85)","v":601460},{"$f":"SUM(J83:J85)","v":388640},601460,388640,601460,388640,601460,388640]
[{"$f":"A85/10000","v":5.8979999999999997},"Ç      Surface    È",null,"Surface È",{"$f":"SUM(E82:E83)/10000","v":11.102130000000001}]
[null,null,null,"p. 1 ha"]
[{"$f":"A98","v":6462076},"GREENHOUSE","CIF & Auxiliary Facilities ","Construction",{"$f":"1678165","v":1678165}]
[0,"Constr. & commiss."]
[6800,"Training 4 x €1700",{"$f":"A91+A92","v":48800},"Equipment",{"$f":"837750","v":837750}]
[42000,"Supervision p.Yr",null,"Supervision ",159600]
[180000,"Trucking","140 trucks","Shipping+Trucking",{"$f":"189500+A93","v":369500}]
[{"$f":"ROUND((SUM(A89:A93)),-1)","v":6690880},"Price",null,"Price",{"$f":"ROUND((SUM(E89:E93)*T3),-1)","v":2496910}]
[{"$f":"A89/A87","v":1095638.521532723},"←  =  1 ha  =  →"]
[{"$f":"A95","v":1095638.521532723}]
[]
[6462076]

{"sheet":"Cap.Goods","index":1,"n_rows":46,"n_cols":26,"rows_kept":46,"cut":false,"hidden":false,"merged":[[39,2,39,3],[48,9,48,10],[48,11,48,12],[39,9,45,9],[48,15,48,18],[24,9,33,9],[23,1,32,1],[33,1,34,1],[15,9,19,9],[15,1,19,1],[22,3,22,4],[14,21,15,25],[4,1,5,1],[5,10,19,10],[15,11,19,11],[6,9,13,9],[6,11,13,11],[6,1,12,1],[23,10,34,10],[24,17,34,17],[36,17,36,18],[24,11,33,11],[15,20,16,20],[36,14,36,15],[45,22,47,23],[1,0,2,0],[2,4,2,9],[2,10,2,11],[4,14,4,15],[22,14,22,15],[4,12,4,13],[5,18,20,18],[23,18,34,18],[22,12,22,13],[39,1,46,1],[6,17,13,17],[15,17,19,17],[8,20,9,20],[12,20,13,20],[12,21,13,25]]}
[]
[]
[null,null,null," Level ①","Zoom 152        Capital Goods and Services ",null,null,null,null,null,null,null,null,null,null,null,null,null,null,null,null,null,null,null,1,{"$f":"Intro!V2","v":1.2195121951219512}]
[null,null,null,null,null,null,null,null,null,null,null,null,null,null,null,{"$f":"BUDGET!D13","v":"2019-06-30"}]
[null,"A","Adv.%","CAPITAL INVESTMENT EXPORT \u0086(Loan \"A\") ",null,null,null,null,"PROJECT FINANCE",null,"D","→","OWN FUNDS Loan \"D\"",null,"Loan \"A\" + VAT + \"D\"",null,"TOTAL",null,null,"Check"]
["Ø",null,{"$f":"Intro!M16","v":5.8979999999999997},null,null,"Net Price"," + VAT incl.","Advance","Balance",null,null,null,{"$f":"N6","v":0},0,"Advance","Balance","Value",null,"→","↓"]
["Ø",null,0.2,null,"       Greenhouse turnkey complex, DDP",{"$f":"SUM(F8:F13)","v":7430876},null,null,null,null,null,null,null,null,null,null,null,null,null,{"$f":"IF(SUM(O8:P8)=(Intro!S57*D7),\"True\",\"False\")","v":"False"},"Loan \"A\"","Purchase, exported cap. goods and services; delivery DDP*"]
[null,null,null,null,"Greenhouse set with the operating structure",{"$f":"Intro!$S$57","v":6702076},null,{"$f":"C7*F8*(1-$N$6)","v":1340415.2000000002},{"$f":"(100%-C7)*F8-(100%-C7)*F8*$N$6","v":5361660.8000000007},null,null,null,{"$f":"C7*F8*$N$6","v":0},{"$f":"(100%-C7)*F8*$N$6","v":0},{"$f":"H8+M8","v":1340415.2000000002},5361660.8000000007,{"$f":"O8+P8","v":6702076.0000000009},null,null,{"$f":"IF(SUM(O9:P9)=Intro!S59,\"True\",\"False\")","v":"False"},"Conditional "]
[null,null,0.25,null,"Construction and installation",{"$f":"Intro!S58","v":500000},null,{"$f":"C9*F9*(1-$N$6)","v":125000},{"$f":"(100%-C9)*F9-(100%-C9)*F9*$N$6","v":375000},null,null,null,{"$f":"C9*F9*$N$6","v":0},{"$f":"(100%-C9)*F9*$N$6","v":0},125000,375000,{"$f":"O9+P9","v":500000},null,null,{"$f":"IF(SUM(O10:P10)=Intro!S60,\"True\",\"False\")","v":"False"},"Loan \"B\"","Could be up to 30% of original part of the export paid by "]
["Ø",null,0,null,"Truck transport",{"$f":"Intro!S59","v":180000},null,{"$f":"C10*F10*(1-$N$6)","v":0},{"$f":"(100%-C10)*F10-(100%-C10)*F10*$N$6","v":180000},null,null,null,{"$f":"C10*F10*$N$6","v":0},{"$f":"(100%-C10)*F10*$N$6","v":0},0,180000,{"$f":"O10+P10","v":180000},null,null,null,null,"Loan \"A\" Greenhouse base, assembling, infrastructure and "]
[null,null,0,null,"Half a Yr supervision and training",{"$f":"Intro!S60+Intro!S61","v":48800},null,{"$f":"C10*F11*(1-$N$6)","v":0},{"$f":"(100%-C10)*F11-(100%-C10)*F11*$N$6","v":48800},null,null,null,{"$f":"C10*F11*$N$6","v":0},{"$f":"(100%-C10)*F11*$N$6","v":0},0,48800,{"$f":"O11+P11","v":48800},null,null,{"$f":"IF(SUM(#REF!)=Intro!S61,\"True\",\"False\")","v":{"$error":"#REF!"}},null,"other LTAssets - all one-off local country costs (up to 30%"]
[null,null,null,null,null,null,null,null,null,null,null,null,null,null,null,null,null,null,null,null,null,"of original part of export value)"]
[null,null,null,null,"Pickup truck for products and staff  . ",null,0,{"$f":"C13*F13*(1-$N$6)","v":0},{"$f":"(100%-C13)*F13-(100%-C13)*F13*$N$6","v":0},null,null,null,{"$f":"C13*F13*$N$6","v":0},{"$f":"(100%-C13)*F13*$N$6","v":0},{"$f":"H13+M13","v":0},0,{"$f":"O13+P13","v":0},null,null,{"$f":"IF(SUM(O13:P13)=Intro!S67,\"True\",\"False\")","v":"True"},"Loan \"C\"","Permanent purchase of production materials and seasonal trade (conditionally - the start-up working materials)"]
[null,{"$f":"IF(C15<=50%,\"\",\"M\")","v":""},null,null,"SubTOTAL:",{"$f":"SUM(F8:F13)","v":7430876},{"$f":"SUM(G7:G13)","v":0},{"$f":"SUM(H8:H13)","v":1465415.2000000002},{"$f":"SUM(I8:I13)","v":5965460.8000000007},null,null,null,{"$f":"SUM(M8:M13)","v":0},{"$f":"SUM(N8:N13)","v":0},{"$f":"SUM(O8:O13)","v":1465415.2000000002},{"$f":"SUM(P8:P13)","v":5965460.8000000007},{"$f":"SUM(Q8:Q13)","v":7430876.0000000009},null,null,{"$f":"IF(F14=Q14,\"True\",\"False\")","v":"True"}]
[null,{"$f":"IF(C15<=50%,\"C\",\"\")","v":"C"},{"$f":"F20/F21","v":0},null,"ELIGIBLE FOREIGN CONTENT (Loan \"A\")","Net Price","VAT incl.","Advance","Balance",null,null,null,null,null,null,null,null,null,null,null,null,"Own funds (Loan \"C\"). Credit percentage down payment, "]
[null,null,null,null,null,null,null,null,null,null,null,null,null,null,null,null,null,null,null,null,"Loan \"D\""]
[null,null,{"$f":"$C$7","v":0.2},{"$f":"100%-D7","v":1},"Greenhouse Screening plots and materials",null,null,{"$f":"C17*F17-C17*F17*$N$6","v":0},{"$f":"(100%-C17)*F17-(100%-C17)*F17*$N$6","v":0},null,null,null,{"$f":"C17*F17*$N$6","v":0},{"$f":"(100%-C17)*F17*$N$6","v":0},{"$f":"H17+M17","v":0},0,{"$f":"O17+P17","v":0},null,null,{"$f":"IF(SUM(O17:P17)=Intro!S57*D17,\"True\",\"False\")","v":"False"},null,"when required (as ECA's practice)"]
[null,null,{"$f":"$C$7","v":0.2},null,"Plants, fertilizers, pesticides, substrate",null,null,{"$f":"C18*F18-C18*F18*$N$6","v":0},{"$f":"(100%-C18)*F18-(100%-C18)*F18*$N$6","v":0},null,null,null,{"$f":"C18*F18*$N$6","v":0},{"$f":"(100%-C18)*F18*$N$6","v":0},0,0,{"$f":"O18+P18","v":0},null,null,null,null,"Involve percentage of own funds, if required, in Cell N6 and click"]
[null,null,0,null,"Shipping",null,null,{"$f":"C19*F19-C19*F19*$N$6","v":0},{"$f":"(100%-C19)*F19-(100%-C19)*F19*$N$6","v":0},null,null,null,{"$f":"C19*F19*$N$6","v":0},{"$f":"(100%-C19)*F19*$N$6","v":0},0,0,{"$f":"O19+P19","v":0},null,null,null,null,"\u0085 \u0085% button left"]
[null,null,null,null,"SubTOTAL:",{"$f":"SUM(F17:F19)","v":0},{"$f":"SUM(G17:G19)","v":0},{"$f":"SUM(H17:H19)","v":0},{"$f":"SUM(I17:I19)","v":0},null,null,null,{"$f":"SUM(M17:M19)","v":0},{"$f":"SUM(N17:N19)","v":0},{"$f":"SUM(O17:O19)","v":0},{"$f":"SUM(P17:P19)","v":0},{"$f":"SUM(Q17:Q19)","v":0},null,null,null,"* DDP - Delivered duty paid"]
[null,null,"Export",{"$f":"F21","v":7430876},"Loan \"A\", EXPORT VALUE, TOTAL:",{"$f":"F14+F20","v":7430876},{"$f":"G14+G20","v":0},{"$f":"H14+H20","v":1465415.2000000002},{"$f":"I14+I20","v":5965460.8000000007},null,null,null,{"$f":"M14+M20","v":0},{"$f":"N14+N20","v":0},{"$f":"O14+O20","v":1465415.2000000002},{"$f":"P14+P20","v":5965460.8000000007},{"$f":"Q14+Q20","v":7430876.0000000009},null,null,{"$f":"IF((O21+P21)=Intro!S56,\"True\",\"False\")","v":"False"}]
[]
[null,"B",null,"LOCAL COUNTRY COSTS \u0086(Loan \"B\")",null,null,null,null,null,null,"D","→","OWN FUNDS Loan \"D\"",null,"Loan \"A\" + VAT + \"D\"",null,"TOTAL"]
[null,null,"Advance, %",null,null,"Net Price","VAT incl.","Advance","Balance",null,null,null,{"$f":"N24","v":0},{"$f":"N6","v":0},"Advance","Balance","Value",null,"→"]
[null,null,null,"Capital investment",null,{"$f":"SUM(F27:F31)","v":653967.94340298511},{"$f":"SUM(G27:G31)","v":657082},{"$f":"SUM(H27:H31)","v":75708.2},{"$f":"SUM(I27:I31)","v":578259.74340298504},null,null,null,{"$f":"SUM(M27:M31)","v":0},0,{"$f":"SUM(O27:O31)","v":75708.2},{"$f":"SUM(P27:P31)","v":578259.74340298504},{"$f":"SUM(Q27:Q31)","v":653967.94340298511},null,null,{"$f":"IF((O25+P25)=Q25,\"True\",\"False\")","v":"True"}]
[null,null,4.7,{"$f":"Intro!C82","v":58368},"available farmland with license",null,{"$f":"C26*D26","v":274329.60000000003},{"$f":"F26","v":0},{"$f":"G26-H26","v":274329.60000000003},null,null,null,{"$f":"H26*$M$24","v":0},{"$f":"I26*$M$24","v":0},{"$f":"H26-M26","v":0},{"$f":"I26-N26","v":274329.60000000003}]
["Ø",null,0.2,"Constructive drawings, permits - electricity, water, etc.",null,{"$f":"Intro!S49","v":50000},{"$f":"Intro!U49","v":302000},{"$f":"C27*F27-C27*F27*$N$6","v":10000},{"$f":"(100%-C27)*F27-(100%-C27)*F27*$N$6","v":40000},null,null,null,{"$f":"C27*F27*$N$24","v":0},{"$f":"(100%-C27)*F27*$N$6","v":0},{"$f":"H27+M27","v":10000},40000,{"$f":"O27+P27","v":50000},null,null,{"$f":"IF(SUM(O27:P27)=Intro!S50,\"True\",\"False\")","v":"False"}]
["Ø",null,0.2,"Terrain, infrastructure - hedge, water § power supply",null,{"$f":"Intro!S50","v":302000},{"$f":"Intro!U50","v":302000},{"$f":"C28*F28-C28*F28*$N$6","v":60400},{"$f":"(100%-C28)*F28-(100%-C28)*F28*$N$6","v":241600},null,null,null,{"$f":"C28*F28*$N$24","v":0},{"$f":"(100%-C28)*F28*$N$6","v":0},60400,241600,{"$f":"O28+P28","v":302000},null,null,{"$f":"IF(SUM(O28:P28)=Intro!#REF!,\"True\",\"False\")","v":{"$error":"#REF!"}}]
[null,null,0.1,"Other unforeseen expenses - land, video control, etc. ",null,{"$f":"Intro!S51","v":53082},{"$f":"Intro!U51","v":53082},{"$f":"C29*F29-C29*F29*$N$6","v":5308.2000000000007},{"$f":"(100%-C29)*F29-(100%-C29)*F29*$N$6","v":47773.8},null,null,null,{"$f":"C29*F29*$N$24","v":0},{"$f":"(100%-C29)*F29*$N$6","v":0},5308.2000000000007,47773.8,{"$f":"O29+P29","v":53082},null,null,{"$f":"IF(SUM(O29:P29)=Intro!S51,\"True\",\"False\")","v":"True"}]
["Ø",null,0,"One year - plants, fertilizers, pesticides, substrate",null,{"$f":"Intro!S55","v":248885.94340298508},{"$f":"Intro!U52","v":0},{"$f":"C30*F30-C30*F30*$N$6","v":0},{"$f":"(100%-C30)*F30-(100%-C30)*F30*$N$6","v":248885.94340298508},null,null,null,{"$f":"C30*F30*$N$24","v":0},{"$f":"(100%-C30)*F30*$N$6","v":0},0,{"$f":"I30+N30","v":248885.94340298508},{"$f":"O30+P30","v":248885.94340298508},null,null,{"$f":"IF(SUM(O30:P30)=Intro!S52,\"True\",\"False\")","v":"False"}]
[null,null,null,"Truck transport",null,null,0,{"$f":"C31*F31-C31*F31*$N$6","v":0},{"$f":"(100%-C31)*F31-(100%-C31)*F31*$N$6","v":0},null,null,null,null,{"$f":"(100%-C31)*F31*$N$24","v":0},0,{"$f":"I31+N31","v":0},{"$f":"O31+P31","v":0}]
[null,null,null,"Financial modeling package and OCFCS",null,{"$f":"SUM(F33:F34)","v":268000},{"$f":"SUM(G33:G34)","v":268000},{"$f":"SUM(H33:H34)","v":254000},{"$f":"SUM(I33:I34)","v":14000},null,null,null,{"$f":"SUM(M33:M34)","v":0},{"$f":"SUM(N33:N34)","v":0},{"$f":"SUM(O33:O34)","v":254000},{"$f":"SUM(P33:P34)","v":14000},{"$f":"SUM(Q33:Q34)","v":268000},null,null,{"$f":"IF((O32+P32)=Q32,\"True\",\"False\")","v":"True"}]
[null,null,1,"Cash-flows, profitability & sensitivity analysis +",null,{"$f":"Intro!S53","v":240000},{"$f":"Intro!U53","v":240000},{"$f":"C33*F33-C33*F33*$N$6","v":240000},{"$f":"(100%-C33)*F33-(100%-C33)*F33*$N$6","v":0},null,null,null,{"$f":"C33*F33*$N$6","v":0},{"$f":"(100%-C33)*F33*$N$6","v":0},{"$f":"H33+M33","v":240000},{"$f":"I33+N33","v":0},{"$f":"O33+P33","v":240000},null,null,{"$f":"IF(SUM(O33:P33)=Intro!S53,\"True\",\"False\")","v":"True"}]
[null,{"$f":"IF(C35<=30%,\"C\",\"N\")","v":"C"},0.5,"Financial risk assessment and management",null,{"$f":"Intro!S54","v":28000},{"$f":"Intro!U54","v":28000},{"$f":"C34*F34-C34*F34*$N$6","v":14000},{"$f":"(100%-C34)*F34-(100%-C34)*F34*$N$6","v":14000},null,null,null,{"$f":"C34*F34*$N$6","v":0},{"$f":"(100%-C34)*F34*$N$6","v":0},{"$f":"H34+M34","v":14000},{"$f":"I34+N34","v":14000},{"$f":"O34+P34","v":28000},null,null,{"$f":"IF(SUM(O34:P34)=Intro!S54,\"True\",\"False\")","v":"True"}]
[null,null,{"$f":"F35/F14","v":0.12407257817288098},null,"LOCAL COUNTRY COSTS (LCC), TOTAL:",{"$f":"F25+F32","v":921967.94340298511},{"$f":"G25+G32","v":925082},{"$f":"H25+H32","v":329708.2},{"$f":"I25+I32","v":592259.74340298504},null,null,null,{"$f":"M25+M32","v":0},{"$f":"N25+N32","v":0},{"$f":"O25+O32","v":329708.2},{"$f":"P25+P32","v":592259.74340298504},{"$f":"Q25+Q32","v":921967.94340298511},null,null,{"$f":"IF(SUM(O35:P35)=Q35,\"True\",\"False\")","v":"True"}]
[null,null,null,null,null,{"$f":"F35/F21","v":0.12407257817288098},{"$f":"G35/G21","v":{"$error":"#DIV/0!"}}]
[null,null,null,null," Import + Local Costs:",{"$f":"F21+F35","v":8352843.9434029851},{"$f":"G21+G35","v":925082},{"$f":"H21+H35","v":1795123.4000000001},{"$f":"I21+I35","v":6557720.5434029857},null,"D","→",{"$f":"M21+M35","v":0},{"$f":"N21+N35","v":0},"WORKING CAPITAL ↓",null,{"$f":"Q21+Q35","v":8352843.943402986}]
[null,null,null,null,null,null,null,null,null,null,null,null,"Loan \"D\"",{"$f":"M37+N37","v":0},null,"Optional:",20000]
[null,null,1E-3,null,"Ann. Interests:",null,0.04,{"$f":"G39","v":0.04},null,null,null,null,5.5E-2,null,null,null,{"$f":"SUM(Q37:Q38)","v":8372843.943402986}]
["Ø",null,"INSURANCE",null,"  DEPRECIATION OF ASSETS",null,"Price",{"$f":"SUM(H41:H46)","v":1080332.1599999999},null,null,null," KEY NOTES:"]
[null,null,1E-3,{"$f":"C41*G41","v":6752.076},"    up to; for industry equipment",0.16,{"$f":"F8+F17+F27","v":6752076},{"$f":"G41*F41","v":1080332.1599999999},null,null,1,null,"*Gradients "," in      Cells","temporary put an approximate value in it without document background and",null,null,null,null,null,null,null,null,"    "]
["Ø",null,null,null,"    Building ",0.04,0,{"$f":"G42*F42","v":0},null,null,null,null,"supported                      "," in      Cells","values with document. Icon      - for URL to data resource.  "]
["Ø",null,null,null,null,null,null,null,null,null,2,null,"The icons     or     ride at Internet sources."]
["Ø",null,0.02,{"$f":"C44*G44","v":0},"    Motor car",0.25,{"$f":"F13","v":0},{"$f":"F44*G44","v":0},null,null,3,null,"Info icons","   provides link to author's information sources."]
["Ø",null,0.02,{"$f":"C45*G45","v":0},"    Truck",0.25,{"$f":"F31","v":0},{"$f":"F45*G45","v":0},null,null,4,null,"Various fonts and background colors represent similar group data resources."]
["Ø",null,null,{"$f":"SUM(D41:D45)","v":6752.076},"    Intangible assets (Fin. modeling)",null,null,null,null,null,5,null,"It's recommendable to follow these indications in order to facilitate the structure identification.",null,null,null,null,null,null,null,null,null,"        Go to BUDGET        and   Financial analyzes"]

{"sheet":"BUDGET","index":2,"n_rows":136,"n_cols":22,"rows_kept":136,"cut":false,"hidden":false,"merged":[[75,15,75,17],[40,18,41,18],[42,0,42,1],[68,0,69,0],[10,0,11,1],[40,15,41,15],[40,16,41,16],[40,17,41,17],[40,11,41,11],[40,10,41,10],[40,12,41,12],[40,14,41,14],[40,9,41,9],[48,0,48,1],[19,1,20,1],[40,13,41,13],[40,3,41,3],[40,4,41,4],[7,3,7,4],[40,6,41,6],[40,7,41,7],[40,5,41,5],[7,11,7,12],[13,9,15,10],[7,13,7,14],[7,7,7,8],[40,8,41,8],[93,0,93,1],[75,0,75,1],[74,0,74,1],[73,0,73,1],[70,0,70,1],[71,0,71,1],[72,0,72,1],[88,0,88,1],[75,13,75,14],[75,10,75,11],[74,3,74,5],[70,2,70,4],[72,13,72,14],[72,10,72,11],[70,9,71,9],[70,10,70,14],[71,6,71,8],[71,2,71,4],[72,6,72,8],[70,6,70,8]]}
["[ Level①","PRE-DESIGN BACKGROUND.","Sales","Jan","Feb","2016-03-31","2016-04-30","2016-05-31","2015-06-30","2015-07-31","2015-08-31","2015-09-30","2015-10-31","2015-11-30","2015-12-31","i TOTAL p.a.i",{"$f":"($Q$2/Intro!U39+$Q$3/Intro!U40)/2","v":0.57690663145203214},{"$f":"($R$2/Intro!U39+$R$3/Intro!U40)/2","v":0.42309336854796775}]
["   Back","Value of production","IncomeTx Mo",{"$f":"Intro!I39","v":0},{"$f":"Intro!J39","v":0},{"$f":"Intro!K39","v":379629.72432000004},{"$f":"Intro!L39","v":534932.79335999989},{"$f":"Intro!M39","v":457381.58382},{"$f":"Intro!N39","v":303115.20624000003},{"$f":"Intro!O39","v":269503.49539890006},{"$f":"Intro!P39","v":219577.93956000003},{"$f":"Intro!Q39","v":220714.95600000003},{"$f":"Intro!R39","v":276629.41152000002},{"$f":"Intro!S39","v":121894.85070000001},{"$f":"Intro!T39","v":94171.714560000022},{"$f":"SUM(D2:O2)","v":2877551.6754789003},{"$f":"SUM(D2:I2)","v":1675059.3077399998},{"$f":"SUM(J2:O2)","v":1202492.3677389002},null,null,null,{"$f":"Q2+R2","v":2877551.6754788999}]
["From Level 0","Business Plan","IncomeCx Mo",{"$f":"Intro!I40","v":0},{"$f":"Intro!J40","v":73750.720942080006},{"$f":"Intro!K40","v":150558.78248208002},{"$f":"Intro!L40","v":190406.74981608},{"$f":"Intro!M40","v":43703.701554240004},{"$f":"Intro!N40","v":125701.18044119999},{"$f":"Intro!O40","v":103264.54650288},{"$f":"Intro!P40","v":114784.69303224001},{"$f":"Intro!Q40","v":26629.787076479999},{"$f":"Intro!R40","v":74647.730304000012},{"$f":"Intro!S40","v":97556.010552000022},{"$f":"Intro!T40","v":20721.715887599999},{"$f":"SUM(D3:O3)","v":1021725.6185908801},{"$f":"SUM(D3:I3)","v":584121.13523568003},{"$f":"SUM(J3:O3)","v":437604.48335520003}]
[{"$f":"Intro!U47","v":8344843.9434029851},"\u0086  Lender/Insurer   (Loan \"A\")","Var. Costs",1,{"$f":"D4+1","v":2},{"$f":"E4+1","v":3},4,5,6,7,8,9,10,11,12,null,{"$f":"(Q5/P5+Q6/P6)/2","v":0.56152369835055427},{"$f":"(R5/P5+R6/P6)/2","v":0.43847630164944562}]
[{"$f":"Intro!V48","v":1173967.9434029851},"\u0086  Local Country Costs +VAT","Heating",{"$f":"Intro!I42","v":40552.194247687505},{"$f":"Intro!J42","v":36865.688790562497},{"$f":"Intro!K42","v":31324.303250812496},{"$f":"Intro!L42","v":23962.708284187498},{"$f":"Intro!M42","v":10994.4736574375},{"$f":"Intro!N42","v":0},{"$f":"Intro!O42","v":0},{"$f":"Intro!P42","v":0},{"$f":"Intro!Q42","v":0},{"$f":"Intro!R42","v":18432.809160875},{"$f":"Intro!S42","v":27649.213741312502},{"$f":"Intro!T42","v":31335.789667249996},{"$f":"SUM(D5:O5)","v":221117.18080012503},{"$f":"SUM(D5:I5)","v":143699.36823068751},{"$f":"SUM(J5:O5)","v":77417.81256943749}]
[{"$f":"Intro!V47","v":{"$error":"#REF!"}},null,"Packing",{"$f":"Intro!I43","v":0},{"$f":"Intro!J43","v":2782.3461120000002},{"$f":"Intro!K43","v":16817.515914},{"$f":"Intro!L43","v":28975.036772999996},{"$f":"Intro!M43","v":27949.896545999996},{"$f":"Intro!N43","v":36165.017265000002},{"$f":"Intro!O43","v":38320.031453999996},{"$f":"Intro!P43","v":34285.130031000001},{"$f":"Intro!Q43","v":21090.841037999999},{"$f":"Intro!R43","v":16611.858552000002},{"$f":"Intro!S43","v":9621.2452050000011},{"$f":"Intro!T43","v":5541.0382950000003},{"$f":"SUM(D6:O6)","v":238159.95718500004},{"$f":"SUM(D6:I6)","v":112689.81260999999},{"$f":"SUM(J6:O6)","v":125470.144575}]
[null,null,"Running costs",null,null,null,null,null,null,null,null,null,null,null,null,{"$f":"SUM(D7:O7)","v":0},{"$f":"SUM(D7:I7)","v":0},{"$f":"SUM(J7:O7)","v":0}]
[null,null,"1 Yr Oper. Costs","T  Fertilizers  C ",null,"T+C Seeds","Substrate","1-6  Water+Electricity  7-12",null,"1-6   SubTotal","7-12  SubTotal","ß  1-Yr  biennially  2 Yr à",null,"1-6 Mo     All Costs    7-12 Mo",null,{"$f":"SUM(P5:P7)","v":459277.13798512507},{"$f":"SUM(Q5:Q7)","v":256389.18084068751},{"$f":"SUM(R5:R7)","v":202887.95714443747}]
[null,null,{"$f":"Intro!M16","v":5.8979999999999997},{"$f":"Intro!H52","v":33203.80334328358},{"$f":"Intro!H53","v":14230.201432835822},{"$f":"Intro!H56","v":115072.62089552238},{"$f":"Intro!H59","v":44494.467985074625},{"$f":"Intro!O55","v":67796.330399999992},{"$f":"Intro!O61","v":41906.469599999997},{"$f":"SUM(D9:G9)/2+H9","v":171296.87722835818},{"$f":"SUM(D9:G9)/2+I9","v":145407.01642835821},"←WITH","WITHOUT→",{"$f":"SUM(D9:F9)/2+H9","v":149049.64323582087},{"$f":"SUM(D9:F9)/2+I9","v":123159.78243582089},null,"❶    30 Jun","31 Dec     ❷    "]
[null,null,"Market products",0,0,0,20000,30000,40000,50000,40000,30000,30000,0,0,{"$f":"SUM(D10:O10)","v":240000},{"$f":"SUM(D10:I10)","v":90000},{"$f":"SUM(J10:O10)","v":150000}]
["From [ Level①",null,"Nr of Periods",1,{"$f":"D11+1","v":2},3,4,5,6,7,8,9,10,11,12,13,14,{"$f":"Q11+1","v":15},{"$f":"R11+1","v":16}]
[null,null,"Nr of Monts",6,{"$f":"D12+6","v":12},18,24,30,36,42,{"$f":"J12+6","v":48},54,60,66,72,78,84,90,{"$f":"R12+6","v":96}]
[null,"  Repayment periods","Date:","2019-06-30","2019-12-31","2020-06-30","2020-12-31","2021-06-30","2021-12-31","2022-06-30","2022-12-31","2023-06-30","2023-12-31","2024-06-30","2024-12-31","2025-06-30","2025-12-31","2026-06-30","2026-12-31"]
[{"$f":"'Cap.Goods'!N38","v":0},"\u0086  Own Funds Loan \"D\"",null,null,null,null,null,null,null,"Level ②"]
[{"$f":"Intro!T51","v":-198000},"\u0086  VAT of Loans \"A\"+\"B\"    Return↔",null,{"$f":"Intro!$T$51","v":-198000},{"$f":"-A15","v":198000}]
[{"$f":"'Cap.Goods'!Q21","v":7430876.0000000009}," Export of cap. goods ",{"$f":"SUM(D16:F16)","v":7430876.0000000009},{"$f":"'Cap.Goods'!O21","v":1465415.2000000002},{"$f":"'Cap.Goods'!P21","v":5965460.8000000007}]
[{"$f":"'Cap.Goods'!Q35","v":921967.94340298511},"Local country costs",{"$f":"SUM(D17:F17)","v":921967.94340298511},{"$f":"'Cap.Goods'!O35","v":329708.2},{"$f":"'Cap.Goods'!P35","v":592259.74340298504}]
[{"$f":"'Cap.Goods'!Q37","v":8352843.943402986}," Capital Investment",{"$f":"SUM(D18:F18)","v":8352843.943402986},{"$f":"SUM(D15:D17)","v":1597123.4000000001},{"$f":"SUM(E15:E17)","v":6755720.5434029857}]
[null,"\u0086  Working Capital  (Loan\"C\")",{"$f":"SUM(F19:Q19)","v":1440000},null,null,{"$f":"Q10","v":90000},{"$f":"$R$10","v":150000},{"$f":"$Q$10","v":90000},{"$f":"$R$10","v":150000},{"$f":"$Q$10","v":90000},{"$f":"$R$10","v":150000},{"$f":"$Q$10","v":90000},{"$f":"$R$10","v":150000},{"$f":"$Q$10","v":90000},{"$f":"$R$10","v":150000},{"$f":"$Q$10","v":90000},{"$f":"$R$10","v":150000},{"$f":"$Q$10","v":90000},{"$f":"$R$10","v":150000}]
[" Sales,","Revenue Pro-forma Budget",{"$f":"SUM(F20:Q20)","v":25150338.54675008},{"$f":"D44","v":0},0,{"$f":"F44","v":2191405.0296864095},{"$f":"G44","v":1590893.9455612772},{"$f":"H44","v":2259180.4429756799},1640096.8510941002,2372139.4651244637,{"$f":"K44","v":1722101.6936488054},2485098.4872732479,1804106.5362035106,2598057.5094220317,1886111.3787582153,2665832.9227113021,{"$f":"Q44","v":1935314.2842910381},{"$f":"R44","v":2259180.4429756799},{"$f":"S44","v":1968116.2213129201}]
["Less:",null,"Date:",{"$f":"D13","v":"2019-06-30"},{"$f":"E13","v":"2019-12-31"},"2020-06-30","2020-12-31","2021-06-30","2021-12-31","2022-06-30","2022-12-31","2023-06-30","2023-12-31","2024-06-30","2024-12-31","2025-06-30","2025-12-31","2026-06-30","2026-12-31"]
["Costs,","TOTAL (in €)",{"$f":"SUM(D22:S22)","v":14741578.189544411},{"$f":"SUM(D23:D26)","v":15700},{"$f":"SUM(E23:E26)","v":142242.13002562098},463331.10163918015,{"$f":"SUM(G23:G26)","v":1496548.3803971868},{"$f":"SUM(H23:H26)","v":617317.24487500091},1624284.6628330075,{"$f":"SUM(J23:J26)","v":644264.54436753818},1651231.962325545,{"$f":"SUM(L23:L26)","v":626844.27764350094},1633811.6956015076,654048.80702078762,1661016.2249787943,636892.71538838802,{"$f":"SUM(Q23:Q26)","v":1643860.1333463946},{"$f":"SUM(R23:R26)","v":651534.7061958058},{"$f":"SUM(S23:S26)","v":578649.60290615365}]
[null,"Variable costs",{"$f":"SUM(D23:Q23)","v":4241086.8922391087},{"$f":"D55","v":0},{"$f":"E55","v":0},{"$f":"F55","v":259701.04761355912},{"$f":"G55","v":205474.09037156589},{"$f":"H55","v":408750.69084937999},{"$f":"I55","v":328633.8728073868},430997.92484191724,350881.10679992411,408750.69084937999,328633.8728073868,430997.92484191724,350881.10679992411,408750.69084937999,328633.8728073868,{"$f":"R55","v":428809.10546574678},{"$f":"S55","v":349171.92617609457}]
[null,"Fixed costs",{"$f":"SUM(D24:Q24)","v":2649928.6770368093},{"$f":"D59","v":15700},131597.10301281049,192985.02701281049,200097.10301281049,197921.52701281046,204673.60301281046,202621.59251281046,209373.66851281046,207448.55978131044,214200.63578131044,212405.85516605992,219157.93116605992,217496.99752619764,224249.07352619764,212080.5737172486,218832.6497172486]
[null,"Marketing & Risk Mngmt",{"$f":"SUM(D25:Q25)","v":138385.35116653651},{"$f":"D65","v":0},10645.027012810498,10645.027012810498,10645.027012810498,10645.027012810498,10645.027012810498,10645.027012810498,10645.027012810498,10645.027012810498,10645.027012810498,10645.027012810498,10645.027012810498,10645.027012810498,10645.027012810498,10645.027012810498,10645.027012810498]
[{"$f":"'Cap.Goods'!H40","v":1080332.1599999999},"Depreciations",null,null,null,null,{"$f":"'Cap.Goods'!$H$41+'Cap.Goods'!H44+'Cap.Goods'!H45","v":1080332.1599999999},null,{"$f":"G26","v":1080332.1599999999},null,{"$f":"G26","v":1080332.1599999999},null,{"$f":"G26","v":1080332.1599999999},null,{"$f":"M26-'Cap.Goods'!H44-'Cap.Goods'!H45","v":1080332.1599999999},null,{"$f":"O26","v":1080332.1599999999},null,{"$f":"'Cap.Goods'!H44+'Cap.Goods'!H45","v":0}]
[null,"Cash Flows (EBIT)",null,{"$f":"D20-D22","v":-15700},{"$f":"E20-E22","v":-142242.13002562098},{"$f":"F20-F22","v":1728073.9280472293},{"$f":"G20-G22","v":94345.565164090367},{"$f":"H20-H22","v":1641863.1981006791},{"$f":"I20-I22","v":15812.18826109264},{"$f":"J20-J22","v":1727874.9207569254},70869.731323260348,1858254.2096297471,170294.84060200304,1944008.7024012441,225095.153779421,{"$f":"P20-P22","v":2028940.2073229142},{"$f":"Q20-Q22","v":291454.15094464342},{"$f":"R20-R22","v":1607645.7367798742},{"$f":"S20-S22","v":1389466.6184067666},null,{"$f":"SUM(D27:Q27)","v":11638944.666307628}]
["Less:","Interests Loans \"A\" + \"B\"",null,{"$f":"D86+D91+D96","v":0},6594,17373,164904,154490,134862,{"$f":"J86+J91+J96","v":116211},98614,82147,66893,52940,40377,29301,{"$f":"Q86+Q91+Q96","v":19810},{"$f":"R86+R91+R96","v":12011},{"$f":"S86+S91+S96","v":6013},null,{"$f":"SUM(D28:Q28)","v":984516}]
[null,"EBT",null,{"$f":"D27-D28","v":-15700},-148836.13002562098,1710700.9280472293,{"$f":"G27-G28","v":-70558.434835909633},{"$f":"H27-H28","v":1487373.1981006791},-119049.81173890736,1611663.9207569254,-27744.268676739652,1776107.2096297471,103401.84060200304,1891068.7024012441,184718.153779421,{"$f":"P27-P28","v":1999639.2073229142},{"$f":"Q27-Q28","v":271644.15094464342},{"$f":"R27-R28","v":1595634.7367798742},{"$f":"S27-S28","v":1383453.6184067666},null,{"$f":"SUM(D29:Q29)","v":10654428.666307628},{"$f":"U29/$Q$12","v":126838.43650366223}]
["Less:","Income tax",0.1,null,null,null,{"$f":"(D29+E29+F29)*C30","v":154616.47980216084},null,{"$f":"(G29+H29)*$C$30-H31","v":64373.236425396535},null,{"$f":"(I29+J29)*$C$30-J31","v":117074.79268910355},null,{"$f":"(K29+L29)*$C$30-L31","v":116298.89775074898},null,{"$f":"(M29+N29)*$C$30-N31","v":141297.60542495025},null,{"$f":"(O29+P29)*$C$30-P31","v":147786.9333977584},null,{"$f":"(Q29+R29)*$C$30-R31","v":112834.42207357258},null,{"$f":"SUM(D26:Q26)","v":6481992.96}]
[null,"Advance deposit",null,null,null,null,null,{"$f":"G30/2","v":77308.239901080422},null,{"$f":"I30/2","v":32186.618212698268},null,{"$f":"K30/2","v":58537.396344551773},null,{"$f":"M30/2","v":58149.448875374488},null,{"$f":"O30/2","v":70648.802712475124},null,{"$f":"Q30/2","v":73893.466698879201},null,null,{"$f":"SUM(U29:U30)","v":17136421.626307629}]
[null,"EAT",{"$f":"SUM(D32:Q32)","v":9616150.2147713322},{"$f":"D29-D30-D31","v":-15700},{"$f":"E29-E30-E31","v":-148836.13002562098},{"$f":"F29-F30-F31","v":1710700.9280472293},{"$f":"G29-G30-G31","v":-225174.91463807048},{"$f":"H29-H30-H31","v":1410064.9581995986},{"$f":"I29-I30-I31","v":-183423.04816430388},{"$f":"J29-J30-J31","v":1579477.3025442271},{"$f":"K29-K30-K31","v":-144819.0613658432},{"$f":"L29-L30-L31","v":1717569.8132851953},{"$f":"M29-M30-M31","v":-12897.057148745938},1832919.2535258697,43420.548354470753,1928990.404610439,123857.21754688502,1521741.270080995,1270619.1963331939,null,{"$f":"SUM(D32:Q32)","v":9616150.2147713322},{"$f":"U32/$Q$12","v":114477.97874727777}]
["Add:","Total depreciations",null,null,{"$f":"E26","v":0},null,{"$f":"G26","v":1080332.1599999999},{"$f":"H26","v":0},1080332.1599999999,0,1080332.1599999999,0,1080332.1599999999,0,1080332.1599999999,0,1080332.1599999999]
["Add:","Tax advance deposited"]
["►"," Operating Cash Flows",{"$f":"SUM(D35:S35)","v":18890503.641185518},{"$f":"SUM(D32:D34)","v":-15700},-148836.13002562098,1710700.9280472293,855157.24536192941,1410064.9581995986,896909.11183569604,1579477.3025442271,935513.09863415675,{"$f":"SUM(L32:L34)","v":1717569.8132851953},1067435.1028512539,1832919.2535258697,1123752.7083544708,1928990.404610439,1204189.3775468851,{"$f":"SUM(R32:R34)","v":1521741.270080995},{"$f":"SUM(S32:S34)","v":1270619.1963331939}]
["Less:",null,null,{"$f":"-D18","v":-1597123.4000000001},{"$f":"-E18","v":-6755720.5434029857},{"$f":"-F18","v":0}]
["►    (NCFs)","Project's Net Cash Flows",{"$f":"SUM(D37:S37)","v":10537659.697782533},{"$f":"D35+D36","v":-1612823.4000000001},-6904556.6734286062,1710700.9280472293,855157.24536192941,{"$f":"H35+H36","v":1410064.9581995986},{"$f":"I35+I36","v":896909.11183569604},1579477.3025442271,935513.09863415675,1717569.8132851953,1067435.1028512539,1832919.2535258697,1123752.7083544708,{"$f":"P35+P36","v":1928990.404610439},{"$f":"Q35+Q36","v":1204189.3775468851},{"$f":"R35+R36","v":1521741.270080995},{"$f":"S35+S36","v":1270619.1963331939}]
["Less: Loans—","Installments (principal + interest)",null,{"$f":"-(D88+D93+D98-D28)","v":0},{"$f":"-(E88+E93+E98-E28)","v":0},{"$f":"-(F88+F93+F98-F28)","v":0},{"$f":"-(G88+G93+G98-G28)","v":-522904},{"$f":"-(H88+H93+H98-H28)","v":-533362},-544030,-554911,-566009,-577329,-588876,-600653,-612666,-624919,-637418,-650166,-663169,null,null,{"$f":"SUM(D38:Q38)","v":-6363077}]
[null,"Cash",null,{"$f":"D37+D38","v":-1612823.4000000001},-6904556.6734286062,1710700.9280472293,332253.24536192941,876702.95819959859,352879.11183569604,{"$f":"J37+J38","v":1024566.3025442271},{"$f":"K37+K38","v":369504.09863415675},{"$f":"L37+L38","v":1140240.8132851953},478559.10285125393,1232266.2535258697,511086.70835447079,1304071.404610439,566771.37754688505,871575.27008099505,607450.19633319392]
["Cumulative NCFs (loan pay-off incl.)",null,"→",{"$f":"D39","v":-1612823.4000000001},{"$f":"D40+E39","v":-8517380.0734286066},{"$f":"E40+F39","v":-6806679.1453813771},{"$f":"F40+G39","v":-6474425.9000194473},{"$f":"G40+H39","v":-5597722.9418198485},{"$f":"H40+I39","v":-5244843.8299841527},-4220277.5274399258,-3850773.428805769,-2710532.6155205737,-2231973.5126693198,-999707.25914345006,{"$f":"N40+O39","v":-488620.55078897928},{"$f":"O40+P39","v":815450.85382145969},{"$f":"P40+Q39","v":1382222.2313683447},{"$f":"Q40+R39","v":2253797.50144934},{"$f":"R40+S39","v":2861247.6977825342}]
[null,"Years :",null,"→",null,-0.03,{"$f":"E41+1","v":1},0,{"$f":"G41+1","v":2},{"$f":"H41+5%","v":0.05},{"$f":"I41+1","v":3},{"$f":"J41+5%","v":0.1},{"$f":"K41+1","v":4},{"$f":"L41+5%","v":0.15000000000000002},{"$f":"M41+1","v":5},{"$f":"N41+3%","v":0.18000000000000002},{"$f":"O41+1","v":6},{"$f":"P41+2%","v":0.2},{"$f":"Q41+1","v":7}]
[]
["Income data. Selected year <+>:",null,"Calendar year",{"$f":"D13","v":"2019-06-30"},{"$f":"E13","v":"2019-12-31"},"2020-06-30","2020-12-31","2021-06-30","2021-12-31","2022-06-30","2022-12-31","2023-06-30","2023-12-31","2024-06-30","2024-12-31","2025-06-30","2025-12-31","2026-06-30","2026-12-31"]
[{"$f":"SUM(F44:Q44)","v":25150338.54675008},"      Sales         ",null,null,null,{"$f":"F45","v":2191405.0296864095},1590893.9455612772,2259180.4429756799,1640096.8510941002,2372139.4651244637,1722101.6936488054,2485098.4872732479,1804106.5362035106,2598057.5094220317,1886111.3787582153,2665832.9227113021,1935314.2842910381,{"$f":"R45","v":2259180.4429756799},{"$f":"S45","v":1968116.2213129201}]
[null,"● Greenhouse own production",null,null,null,{"$f":"SUM(F46:F47)","v":2191405.0296864095},{"$f":"SUM(G46:G47)","v":1590893.9455612772},2259180.4429756799,1640096.8510941002,2372139.4651244637,1722101.6936488054,2485098.4872732479,1804106.5362035106,2598057.5094220317,1886111.3787582153,2665832.9227113021,1935314.2842910381,{"$f":"SUM(R46:R48)","v":2259180.4429756799},{"$f":"SUM(S46:S48)","v":1968116.2213129201}]
[null,"   • Tomatoes",null,null,null,{"$f":"Q2*(1+$F$41)","v":1624807.5285077998},{"$f":"R2*(1+$F$41)","v":1166417.5967067331},{"$f":"$Q$2","v":1675059.3077399998},{"$f":"$R$2","v":1202492.3677389002},{"$f":"$Q$2*(1+J41)","v":1758812.2731269998},{"$f":"$R$2*(1+J41)","v":1262616.9861258452},{"$f":"$Q$2*(1+L41)","v":1842565.2385140001},{"$f":"$R$2*(1+L41)","v":1322741.6045127905},{"$f":"$Q$2*(1+N41)","v":1926318.2039009996},{"$f":"$R$2*(1+N41)","v":1382866.2228997352},{"$f":"$Q$2*(1+P41)","v":1976569.9831331996},{"$f":"$R$2*(1+P41)","v":1418940.9939319021},{"$f":"$Q$2","v":1675059.3077399998},{"$f":"$R$2*(1+R41)","v":1442990.8412866802}]
[null,"   • Cucumbers",null,null,null,{"$f":"Q3*(1+$F$41)","v":566597.50117860967},{"$f":"R3*(1+$F$41)","v":424476.34885454405},{"$f":"$Q$3","v":584121.13523568003},{"$f":"$R$3","v":437604.48335520003},{"$f":"$Q$3*(1+J41)","v":613327.19199746405},{"$f":"$R$3*(1+J41)","v":459484.70752296003},{"$f":"$Q$3*(1+L41)","v":642533.24875924806},{"$f":"$R$3*(1+L41)","v":481364.93169072008},{"$f":"$Q$3*(1+N41)","v":671739.30552103196},{"$f":"$R$3*(1+N41)","v":503245.15585848002},{"$f":"$Q$3*(1+P41)","v":689262.93957810244},{"$f":"$R$3*(1+P41)","v":516373.29035913601},{"$f":"$Q$3","v":584121.13523568003},{"$f":"$R$3*(1+R41)","v":525125.38002624002}]
[null,"   • By-products"]
["OPERATIONAL AND RISK MANAGEMENT",null,"Option: Funding",null,1000,0.5,0.3,0.2,{"$f":"$E$49*F49","v":500},{"$f":"$E$49*G49","v":300},{"$f":"$E$49*H49","v":200},0]
[null,"Dynamic structure of new loan with",0.06,"Select and","↑ ENTER ↑",null,null,"New debt to add to the Costs→",0,{"$f":"I49*(1+$C$50/2)","v":515},{"$f":"J49*(1+$C$50/2)","v":309},{"$f":"K49*(1+$C$50/2)","v":206}]
[" Sales,","Current accounting reports"]
["Costs,","TOTAL accounting reports"]
["OCFCS","Cash Flow Statements       ‒","Аccounting"]
[null,"Income data (in €), EU Zone   Periods:",{"$f":"C13","v":"Date:"},{"$f":"D13","v":"2019-06-30"},{"$f":"E13","v":"2019-12-31"},"2020-06-30","2020-12-31","2021-06-30","2021-12-31","2022-06-30","2022-12-31","2023-06-30","2023-12-31","2024-06-30","2024-12-31","2025-06-30","2025-12-31",{"$f":"#REF!","v":{"$error":"#REF!"}},{"$f":"T13","v":"00:00:00"}]
[null,"      Variable costs ",{"$f":"SUM(D55:S55)","v":5019067.9238809496},{"$f":"SUM(D56:D58)","v":0},{"$f":"SUM(E56:E58)","v":0},{"$f":"SUM(F56:F58)-F57","v":259701.04761355912},{"$f":"SUM(G56:G58)-G57","v":205474.09037156589},{"$f":"SUM(H56:H58)","v":408750.69084937999},{"$f":"SUM(I56:I58)","v":328633.8728073868},{"$f":"SUM(J56:J58)","v":430997.92484191724},350881.10679992411,408750.69084937999,328633.8728073868,430997.92484191724,{"$f":"SUM(O56:O58)","v":350881.10679992411},408750.69084937999,328633.8728073868,428809.10546574678,349171.92617609457]
[{"$f":"Q8","v":256389.18084068751},"1st Heating, packing, running costs 2nd",{"$f":"R8","v":202887.95714443747},0,0,{"$f":"$A$56","v":256389.18084068751},{"$f":"$C$56","v":202887.95714443747},{"$f":"$A$56","v":256389.18084068751},{"$f":"$C$56","v":202887.95714443747},{"$f":"$A$56","v":256389.18084068751},{"$f":"$C$56","v":202887.95714443747},{"$f":"$A$56","v":256389.18084068751},{"$f":"$C$56","v":202887.95714443747},{"$f":"$A$56","v":256389.18084068751},{"$f":"$C$56","v":202887.95714443747},{"$f":"$A$56","v":256389.18084068751},{"$f":"$C$56","v":202887.95714443747},{"$f":"$A$56","v":256389.18084068751},{"$f":"$C$56","v":202887.95714443747}]
[null,"Operat. costs ̶ fertilizers, substrate, etc.",null,0,0,{"$f":"H9","v":67796.330399999992},{"$f":"I9","v":41906.469599999997},{"$f":"$N$9","v":149049.64323582087},{"$f":"$O$9","v":123159.78243582089},{"$f":"$J$9","v":171296.87722835818},{"$f":"$K$9","v":145407.01642835821},{"$f":"$N$9","v":149049.64323582087},{"$f":"$O$9","v":123159.78243582089},{"$f":"$J$9","v":171296.87722835818},{"$f":"$K$9","v":145407.01642835821},{"$f":"$N$9","v":149049.64323582087},{"$f":"$O$9","v":123159.78243582089},{"$f":"$J$9","v":171296.87722835818},{"$f":"$K$9","v":145407.01642835821}]
[2000,"p.ann./ha.  Other materials and services ",null,null,null,{"$f":"$A$58/2*$C$9*$Q$4","v":3311.8667728715691},{"$f":"$A$58/2*$C$9*$R$4","v":2586.1332271284305},{"$f":"$A$58/2*$C$9*$Q$4","v":3311.8667728715691},{"$f":"$A$58/2*$C$9*$R$4","v":2586.1332271284305},{"$f":"$A$58/2*$C$9*$Q$4","v":3311.8667728715691},{"$f":"$A$58/2*$C$9*$R$4","v":2586.1332271284305},{"$f":"$A$58/2*$C$9*$Q$4","v":3311.8667728715691},{"$f":"$A$58/2*$C$9*$R$4","v":2586.1332271284305},{"$f":"$A$58/2*$C$9*$Q$4","v":3311.8667728715691},{"$f":"$A$58/2*$C$9*$R$4","v":2586.1332271284305},{"$f":"$A$58/2*$C$9*$Q$4","v":3311.8667728715691},{"$f":"$A$58/2*$C$9*$R$4","v":2586.1332271284305},{"$f":"$A$58*$Q$4","v":1123.0473967011085},{"$f":"$A$58*$R$4","v":876.95260329889129}]
[{"$f":"IF(C9>=2.5,3600,IF(AND(C9>=1,C9<3),3000,IF(AND(C9>0.5,C9<=1),1000,0)))","v":3600},"      Fixed costs",{"$f":"SUM(D59:S59)","v":3080841.9004713064},{"$f":"SUM(D60:D65)","v":15700},131597.10301281049,192985.02701281049,{"$f":"SUM(G60:G65)","v":200097.10301281049},{"$f":"SUM(H60:H65)","v":197921.52701281046},204673.60301281046,202621.59251281046,209373.66851281046,207448.55978131044,214200.63578131044,212405.85516605992,219157.93116605992,217496.99752619764,224249.07352619764,{"$f":"SUM(R60:R64)","v":212080.5737172486},{"$f":"SUM(S60:S64)","v":218832.6497172486}]
[1200,"Office - phones, internet, rent, power",null,100,200,240,{"$f":"$A$60/2","v":600},600,600,600,600,600,600,600,600,600,600,600,600]
[0,"Cars - fuel and maintenance ",null,0,0,0,{"$f":"$A$61/2","v":0},{"$f":"$A$61/2","v":0},0,0,0,0,0,0,0,0,0,0,0]
[25200,"Fin. reporting, Online Cash-Flow Control System",null,0,1000,{"$f":"$A$62/2","v":12600},12600,12600,12600,12600,12600,12600,12600,12600,12600,12600,12600,12600,12600]
[2.7E-2,"Payroll, administration, p. ann.",{"$f":"Staff!G12+Staff!G26+Staff!G31","v":339000},{"$f":"(Staff!G19+Staff!G20+Staff!G21+Staff!G22)/3","v":15600},{"$f":"C63/3","v":113000},{"$f":"$C$63/2","v":169500},{"$f":"$C$63/2","v":169500},{"$f":"F63*(1+$A$63)","v":174076.49999999997},174076.49999999997,178776.56549999997,178776.56549999997,183603.53276849995,183603.53276849995,188560.82815324943,188560.82815324943,193651.97051338715,193651.97051338715,198880.5737172486,198880.5737172486]
[{"$f":"'Cap.Goods'!D46","v":6752.076},"Insurance of building, products, cars",null,{"$f":"'Cap.Goods'!D44","v":0},{"$f":"A64-$D$64","v":6752.076},{"$f":"'Cap.Goods'!$D$44","v":0},{"$f":"$A$64-$F$64","v":6752.076},{"$f":"'Cap.Goods'!$D$44","v":0},{"$f":"$A$64-$F$64","v":6752.076},{"$f":"'Cap.Goods'!$D$44","v":0},{"$f":"$A$64-$F$64","v":6752.076},{"$f":"'Cap.Goods'!$D$44","v":0},{"$f":"$A$64-$F$64","v":6752.076},{"$f":"'Cap.Goods'!$D$44","v":0},{"$f":"$A$64-$F$64","v":6752.076},{"$f":"'Cap.Goods'!$D$44","v":0},{"$f":"$A$64-$F$64","v":6752.076},{"$f":"'Cap.Goods'!$D$44","v":0},{"$f":"$A$64-$F$64","v":6752.076}]
[{"$f":"0.13%*M78","v":2.7299999999999994E-3},"of sales - marketing, exhibitions",{"$f":"Intro!U41","v":3899277.2940697805},null,{"$f":"$A$65*$C$65","v":10645.027012810498},{"$f":"IF(AND($M$76>$A$67,F54>E54),$A$65*$C$65,E65)","v":10645.027012810498},10645.027012810498,10645.027012810498,10645.027012810498,10645.027012810498,10645.027012810498,{"$f":"IF(AND($M$76>$A$67,L54>K54)*$C$65,K65)","v":10645.027012810498},{"$f":"IF(AND($M$76>$A$67,M54>L54),$A$65*$C$65,L65)","v":10645.027012810498},{"$f":"IF(AND($M$76>$A$67,N54>M54),$A$65*$C$65,M65)","v":10645.027012810498},{"$f":"IF(AND($M$76>$A$67,O54>N54),$A$65*$C$65,N65)","v":10645.027012810498},{"$f":"IF(AND($M$76>$A$67,P54>O54),$A$65*$C$65,O65)","v":10645.027012810498},{"$f":"IF(AND($M$76>$A$67,Q54>P54),$A$65*$C$65,P65)","v":10645.027012810498},{"$f":"$A$65*$C$65","v":10645.027012810498},{"$f":"$A$65*$C$65","v":10645.027012810498}]
[]
["2018-03-22","Turnkey - start date of operation\nRestarted for corrections\n"]
["3039-02-02T16:00:00",null,null,null,"Years:",1,{"$f":"F68+1","v":2},3,4,5,6,7,null,null,null,null,null,null,null,"up"]
["Level ❸","PROFITABILITY ANALYSIS",null,"Up front investment:",{"$f":"-C18","v":-8352843.943402986},{"$f":"F39+G39","v":2042954.1734091588},{"$f":"H39+I39","v":1229582.0700352946},{"$f":"J39+K39","v":1394070.4011783837},{"$f":"L39+M39","v":1618799.9161364492},{"$f":"N39+O39","v":1743352.9618803405},{"$f":"P39+Q39","v":1870842.782157324},{"$f":"R39+S39","v":1479025.466414189}]
[null,"1-Yr period Operating Cash Flows",null,null,"Debt-Service Coverage Ratio = EBIT/Costs",{"$f":"SUM(G70:M70)/T70","v":2.0300186568322469},{"$f":"(G29+G26)/G88","v":1.6451050825002898},{"$f":"(I29+I26)/I88","v":1.587117822111902},{"$f":"(J29+J26)/J88","v":2.6923348024378484},{"$f":"(K29+K26)/K88","v":1.7759831060713476},{"$f":"(M29+M26)/M88","v":2.0251801525419721},{"$f":"(O29+O26)/O88","v":2.1743657013544486},{"$f":"(Q29+Q26)/Q88","v":2.3100439308079199},null,null,null,null,null,null,{"$f":"MATCH(50,G70:S70)","v":"1900-01-07"}]
["Discounted Cash Flow Models",null,"The Investor can make enough in operating ",null,null,{"$f":"IF(F70>=1.2,\"Good\",\"Bad\")","v":"Good"},"Default Risk Management ",null,null,null,"Operational Risk Management"]
["Section MEASURING PROFITABILITY",null,"profits to pay its current debt service costs. It is subject of fiscal year-end monitoring.",null,null,"DSCR","Section",null,null,null,null,null,"Section \"SENSITIVITY ANALYSIS\""]
[null,null,null,null,null,"Level④","PAYBACK PERIOD",null,null,null,"Simulation of Good Market",null,"Enter A1 share","Simulation of Bad Market"]
["Discount (hurdle) rate :",null,6.5000000000000002E-2,"Loan Life Coverage Ratio",null,null,"Period:",{"$f":"D132","v":6},{"$f":"E132","v":3.7609448396554939},null,{"$f":"IF(Bayes!C7>Bayes!C9,\"A1\",\"A2\")","v":"A1"},"Salesman",67,{"$f":"IF(Bayes!C7<Bayes!C9,\"A1 \",\"A2\")","v":"A2"},"Salesman"]
["Net Present Value (NPV for CADS) :",null,{"$f":"NPV(C74,E69:L69)","v":533577.64240955072},"Unlike period-on-period measures such as the above DSCR, it provides the Lender with a measure of the number of times the cash flow over the scheduled loan life can repay the outstanding debt balance.",null,null,"Date:","2022-06-30","earliness",null,null,79,{"$f":"M74/100","v":0.67},{"$f":"100-L75","v":21}]
["IRR :",null,{"$f":"IRR(E69:L69)","v":8.4136860247935319E-2},6.5000000000000002E-2,"LLCR =",{"$f":"C75/A87","v":7.8132868696071014E-2},null,"Accelerated amortization of loans",null,null,"  Good sales",null,"2018-06-17","      Bad sales         Select→",null,"distribution of sales."]
[1,"Commercial bank, Own funds (Loan \"D\")",{"$f":"SUM(D77+E77)","v":0},{"$f":"'Cap.Goods'!M37","v":0},{"$f":"'Cap.Goods'!N37","v":0},0,null,"Update £  it now.",null,null,null,null," . Correction factor for Area of critical announcement"]
[null,null,null,null,null,null,null,null,null,null,null,null,{"$f":"IF(AND(L75>90,N75>60),\" STOP! Calm down. You've just entered a field of dreams!\",Bayes!P21)","v":2.0999999999999996}]
[null,"Loan \"C\" Local market vegetables",null,null,0,{"$f":"Q10","v":90000},{"$f":"$R$10","v":150000},{"$f":"$Q$10","v":90000},{"$f":"$R$10","v":150000},{"$f":"$Q$10","v":90000},{"$f":"$R$10","v":150000},{"$f":"$Q$10","v":90000},{"$f":"$R$10","v":150000},{"$f":"$Q$10","v":90000},{"$f":"$R$10","v":150000},{"$f":"$Q$10","v":90000},{"$f":"$R$10","v":150000},{"$f":"$Q$10","v":90000},{"$f":"$R$10","v":150000}]
[null,{"$f":"O16","v":0},{"$f":"C13","v":"Date:"},"2019-06-30","2019-12-31","2020-06-30","2020-12-31","2021-06-30","2021-12-31","2022-06-30","2022-12-31","2023-06-30","2023-12-31","2024-06-30","2024-12-31","2025-06-30","2025-12-31","2026-06-30","2026-12-31"]
[null,"LOANS              Number of Periods",{"$f":"C12","v":"Nr of Monts"},null,null,{"$f":"E12","v":12},18,24,30,36,42,48,54,60,66,72,78,{"$f":"P12","v":78},{"$f":"Q12","v":84}]
[null," Nr. of periods",{"$f":"MATCH(50,E82:S82)","v":15},null,1,{"$f":"E82+1","v":2},{"$f":"F82+1","v":3},{"$f":"G82+1","v":4},5,6,7,8,9,10,11,12,13,14,{"$f":"R82+1","v":15}]
[null," Nr. of principal period repayments",{"$f":"MATCH(50,F83:S83)","v":14},null,null,{"$f":"D11","v":1},2,3,4,5,6,7,8,9,10,11,12,13,14]
[]
["TOTAL:"," Loan \"A\", Balance liabilities",{"$f":"C16","v":7430876.0000000009},{"$f":"C85","v":7430876.0000000009},{"$f":"D85","v":7430876.0000000009},{"$f":"E85","v":7430876.0000000009},{"$f":"F85-F87","v":7430876.0000000009},{"$f":"G85-G87","v":6965689.0000000009},{"$f":"H85-H87","v":6491198.0000000009},6007217.0000000009,5513556.0000000009,{"$f":"K85-K87","v":5010022.0000000009},{"$f":"L85-L87","v":4496417.0000000009},{"$f":"M85-M87","v":3972540.0000000009},{"$f":"N85-N87","v":3438186.0000000009},2893145.0000000009,{"$f":"P85-P87","v":2337203.0000000009},{"$f":"Q85-Q87","v":1770142.0000000009},{"$f":"R85-R87","v":1191740.0000000009}]
[{"$f":"SUM(G86:S86)","v":885325},"\u0085  Interest payments",{"$f":"'Cap.Goods'!G39","v":0.04},null,null,null,{"$f":"-ROUND(IPMT($C$86/2,F83,$C$83,F85),0)","v":148618},139314,121697,104951,89145,74347,60631,48076,36761,26773,18199,11135,5678,{"$f":"SUM(G86:R86)","v":"4308-05-22"}]
[{"$f":"SUM(G87:S87)","v":6829106},"\u0085 Principal installments",null,null,null,null,{"$f":"-ROUND(PPMT($C$86/2,F83,$C$83,$C$85),0)","v":465187},474491,483981,493661,503534,513605,523877,534354,545041,555942,567061,578402,589970,{"$f":"SUM(G87:R87)","v":6239136}]
[{"$f":"SUM(A86:A87)","v":7714431},"Installments, TOTAL:",{"$f":"SUM(D88:Q88)","v":6529246},{"$f":"SUM(D86:D87)","v":0},0,0,613805,613805,605678,598612,{"$f":"SUM(K86:K87)","v":592679},{"$f":"SUM(L86:L87)","v":587952},584508,582430,{"$f":"SUM(O86:O87)","v":581802},{"$f":"SUM(P86:P87)","v":582715},{"$f":"SUM(Q86:Q87)","v":585260},{"$f":"SUM(R86:R87)","v":589537},{"$f":"SUM(S86:S87)","v":595648}]
[]
["TOTAL:"," Loan \"B\", Balance liabilities",{"$f":"C17","v":921967.94340298511},{"$f":"D17","v":329708.2},{"$f":"D90+E17","v":921967.94340298511},{"$f":"E90+F17","v":921967.94340298511},{"$f":"F90-F92","v":921967.94340298511},{"$f":"G90-G92","v":864250.94340298511},{"$f":"H90-H92","v":805379.94340298511},{"$f":"I90-I92","v":745330.94340298511},{"$f":"J90-J92","v":684080.94340298511},621605.94340298511,557881.94340298511,492882.94340298511,426583.94340298511,358958.94340298511,289981.94340298511,{"$f":"Q90-Q92","v":219624.94340298511},{"$f":"R90-R92","v":147860.94340298511}]
[{"$f":"SUM(D91:S91)","v":117215},"\u0085  Interest payments",{"$f":"'Cap.Goods'!H39","v":0.04},null,{"$f":"-ROUND(IPMT($C$91/2,E82,$C$82,D90),0)","v":6594},{"$f":"-ROUND(IPMT($C$91/2,F82,$C$82,E90),0)","v":17373},{"$f":"-ROUND(IPMT($C$91/2,G82,$C$82,F90),0)","v":16286},{"$f":"-ROUND(IPMT($C$91/2,H82,$C$82,G90),0)","v":15176},{"$f":"-ROUND(IPMT($C$91/2,I82,$C$82,H90),0)","v":13165},{"$f":"-ROUND(IPMT($C$91/2,J82,$C$82,I90),0)","v":11260},9469,7800,6262,4864,3616,{"$f":"-ROUND(IPMT($C$91/2,P82,$C$82,O90),0)","v":2528},{"$f":"-ROUND(IPMT($C$91/2,Q82,$C$82,P90),0)","v":1611},{"$f":"-ROUND(IPMT($C$91/2,R82,$C$82,Q90),0)","v":876},{"$f":"-ROUND(IPMT($C$91/2,S82,$C$82,R90),0)","v":335},{"$f":"SUM(G91:R91)","v":"2154-05-20"}]
[{"$f":"SUM(D92:Q92)","v":702343},"\u0085 Principal installments",{"$f":"ROUND(SUM(D92:S92),-1)","v":847310},null,null,null,{"$f":"-ROUND(PPMT($C$91/2,F83,$C$83,$C$90),0)","v":57717},58871,60049,61250,62475,63724,64999,66299,67625,68977,70357,71764,73199]
[{"$f":"SUM(D93:S93)","v":964521},"Installments, TOTAL:",{"$f":"SUM(D93:Q93)","v":818347},{"$f":"SUM(D91:D92)","v":0},{"$f":"SUM(E91:E92)","v":6594},{"$f":"SUM(F91:F92)","v":17373},{"$f":"SUM(G91:G92)","v":74003},{"$f":"SUM(H91:H92)","v":74047},{"$f":"SUM(I91:I92)","v":73214},{"$f":"SUM(J91:J92)","v":72510},{"$f":"SUM(K91:K92)","v":71944},71524,71261,71163,71241,{"$f":"SUM(P91:P92)","v":71505},{"$f":"SUM(Q91:Q92)","v":71968},{"$f":"SUM(R91:R92)","v":72640},{"$f":"SUM(S91:S92)","v":73534}]
["Diversification following from Risk Assessment"]
["OPERATIONAL TEST }  Balance liabilities",null,{"$f":"C77","v":0},{"$f":"D77","v":0},{"$f":"D95+E77","v":0},{"$f":"E95+F77","v":0},{"$f":"F95-F97","v":0},{"$f":"G95-G97","v":0},{"$f":"H95-H97","v":0},0,0,0,0,0,0,0,0,{"$f":"Q95-Q97","v":0},{"$f":"R95-R97","v":0}]
[{"$f":"ROUND(SUM(D96:Q96),-1)","v":0},"\u0085  Interest payments",{"$f":"'Cap.Goods'!M39","v":5.5E-2},null,{"$f":"-ROUND(IPMT($C$96/2,E82,$C$82,D95),0)","v":0},{"$f":"-ROUND(IPMT($C$96/2,F82,$C$82,E95),0)","v":0},{"$f":"-ROUND(IPMT($C$96/2,G82,$C$82,F95),0)","v":0},{"$f":"-ROUND(IPMT($C$96/2,G83,$C$83,G95),0)","v":0},0,0,0,0,0,0,0,0,0,0,0,{"$f":"SUM(G96:R96)","v":"00:00:00"}]
[null," Principal deferred payments",{"$f":"C77","v":0},null,null,null,{"$f":"-ROUND(PPMT($C$96/2,F83,$C$83,$C$95),0)","v":0},{"$f":"-ROUND(PPMT($C$96/2,H82,$C$82,$C$95),0)","v":0},{"$f":"-ROUND(PPMT($C$96/2,I82,$C$82,$C$95),0)","v":0},0,0,0,0,0,0,0,{"$f":"-ROUND(PPMT($C$96/2,Q82,$C$82,$C$95),0)","v":0},{"$f":"-ROUND(PPMT($C$96/2,R82,$C$82,$C$95),0)","v":0},{"$f":"-ROUND(PPMT($C$96/2,S82,$C$82,$C$95),0)","v":0}]
[null,"Installments, TOTAL:",null,null,{"$f":"SUM(E96:E97)","v":0},{"$f":"SUM(F96:F97)","v":0},{"$f":"SUM(G96:G97)","v":0},{"$f":"SUM(H96:H97)","v":0},{"$f":"SUM(I96:I97)","v":0},0,0,0,0,0,0,0,0,{"$f":"SUM(R96:R97)","v":0},{"$f":"SUM(S96:S97)","v":0}]
[]
[{"$f":"A86+A91+A96","v":1002540},"GRAPHS",null,1,{"$f":"D100+1","v":2},{"$f":"E100+1","v":3},4,5,6,7,8,9,10,11,12,{"$f":"O100+1","v":13},{"$f":"P100+1","v":14},{"$f":"Q100+1","v":15},{"$f":"R100+1","v":16}]
[null,"Total balance liabilities,  Loan \"A\"",null,{"$f":"D85","v":7430876.0000000009},7430876.0000000009,{"$f":"F85","v":7430876.0000000009},7430876.0000000009,6965689.0000000009,{"$f":"I85","v":6491198.0000000009},6007217.0000000009,5513556.0000000009,5010022.0000000009,4496417.0000000009,3972540.0000000009,3438186.0000000009,2893145.0000000009,2337203.0000000009,{"$f":"R85","v":1770142.0000000009},{"$f":"S85","v":1191740.0000000009}]
[null,"OPERATING PERIOD } Total balance liabilities \"A\"","IN OPERATION",{"$f":"D85","v":7430876.0000000009},{"$f":"E85","v":7430876.0000000009},{"$f":"F85","v":7430876.0000000009},{"$f":"G85","v":7430876.0000000009},{"$f":"H85","v":6965689.0000000009},{"$f":"I85","v":6491198.0000000009},6007217.0000000009,5513556.0000000009,5010022.0000000009,4496417.0000000009,3972540.0000000009,3438186.0000000009,2893145.0000000009,2337203.0000000009,{"$f":"R85","v":1770142.0000000009},{"$f":"S85","v":1191740.0000000009}]
[{"$f":"IF(SUM(G86:Q86)=C85,\"True\",\"False\")","v":"False"},"Cash",null,{"$f":"D39","v":-1612823.4000000001},-6904556.6734286062,1710700.9280472293,332253.24536192941,876702.95819959859,352879.11183569604,1024566.3025442271,369504.09863415675,1140240.8132851953,478559.10285125393,1232266.2535258697,511086.70835447079,1304071.404610439,566771.37754688505,871575.27008099505,607450.19633319392]
[null,"Cash Cumulative",null,{"$f":"D40","v":-1612823.4000000001},-8517380.0734286066,-6806679.1453813771,-6474425.9000194473,-5597722.9418198485,-5244843.8299841527,-4220277.5274399258,-3850773.428805769,-2710532.6155205737,-2231973.5126693198,-999707.25914345006,-488620.55078897928,815450.85382145969,1382222.2313683447,2253797.50144934,2861247.6977825342]
[null,"Operating cash cumulative",null,{"$f":"D35","v":-15700},{"$f":"D35+E35","v":-164536.13002562098},{"$f":"E35+F35","v":1561864.7980216083},{"$f":"F35+G35","v":2565858.1734091588},{"$f":"H125","v":3811387.0015831366},4708296.1134188324,6287773.4159630593,7223286.5145972157,8940856.327882411,10008291.430733666,11841210.684259536,12964963.392614007,14893953.797224445,16098143.174771331,17302332.552318215,18506521.929865099]
[null,null,null,null,null,null,null,null,null,null,null,null,null,null,null,null,null,null,null,"up"]
[]
[]
[]
[]
[]
[]
[]
[]
[]
[]
[]
[]
[]
[]
[]
[null,null,"Debt Rate",{"$f":"D102/$C$18","v":0.88962227121085524},0.88962227121085524,0.88962227121085524,0.88962227121085524,0.8339302215147274,0.77712429969755403,0.71918223789449054,0.66008128936187849,0.59979834819694899,0.53830970989841576,0.47559131080588229,0.41161860838013797,0.34636646148345501,0.27980925009929181]
[null,null,"Start date"]
[null,"Auxiliary rows: Crossing point of cash and debt",{"$f":"D80","v":"2019-06-30"},1,{"$f":"D124+1","v":2},{"$f":"E124+1","v":3},4,5,6,7,8,9,10,{"$f":"M124+1","v":11},12,13,14,{"$f":"Q124+1","v":15},{"$f":"R124+1","v":16}]
[null,"Payback   >   cumulate OCFs",{"$f":"MATCH(A128,D105:Q105)","v":2},{"$f":"$D$35","v":-15700},{"$f":"D125+$E$35","v":-164536.13002562098},{"$f":"E125+$F$35","v":1546164.7980216083},{"$f":"F125+$G$35","v":2401322.0433835378},{"$f":"G125+$H$35","v":3811387.0015831366},{"$f":"H125+$I$35","v":4708296.1134188324},{"$f":"I125+$J$35","v":6287773.4159630593},{"$f":"J125+$K$35","v":7223286.5145972157},{"$f":"K125+$L$35","v":8940856.327882411},{"$f":"L125+$M$35","v":10008291.430733666},{"$f":"M125+$N$35","v":11841210.684259536},{"$f":"N125+$O$35","v":12964963.392614007},{"$f":"O125+$P$35","v":14893953.797224445},{"$f":"P125+$Q$35","v":16098143.174771331},{"$f":"Q125+$Q$35","v":17302332.552318215},{"$f":"R125+$Q$35","v":18506521.929865099}]
[null,"repayment estimatior row",{"$f":"DATE(YEAR(C124)+C125,MONTH(C124)+2,DAY(C124+7))","v":"2021-08-07"},{"$f":"CHOOSE(C125,E80,F80,G80,H80,I80,J80,K80,L80,M80,N80,O80,P80,Q80)","v":"2020-06-30"},{"$f":"C125*6","v":12},{"$f":"E126/12","v":1},{"$f":"ROUNDUP(F126,0)","v":1},{"$f":"G126-F126","v":0},{"$f":"H126*12","v":0}]
[null,"auxiliary row","Payback date",null,{"$f":"(D126-E80)/12","v":15.166666666666666},{"$f":"ROUNDDOWN(E127,0)","v":15},{"$f":"E127-F127","v":0.16666666666666607},{"$f":"G127*12","v":1.9999999999999929},{"$f":"IF(H127=12,F127+1,F127)","v":15},{"$f":"IF(H127=12,0,H127)","v":1.9999999999999929}]
[{"$f":"C86","v":0.04},"Base forecast"]
[{"$f":"D132*365+1+E132*30+4","v":2307.828345189665},"Yr:",null,1,2,3,4,5,6,7,8]
[{"$f":"A129/(365+1)","v":6.3055419267477184},"AnnNCinF",null,{"$f":"D39+E39","v":-8517380.0734286066},{"$f":"F39+G39","v":2042954.1734091588},{"$f":"H39+I39","v":1229582.0700352946},{"$f":"J39+K39","v":1394070.4011783837},{"$f":"L39+M39","v":1618799.9161364492},{"$f":"N39+O39","v":1743352.9618803405},{"$f":"P39+Q39","v":1870842.782157324}]
[{"$f":"D21","v":"2019-06-30"},"Comulative",null,{"$f":"D130","v":-8517380.0734286066},{"$f":"D131+E130","v":-6474425.9000194483},{"$f":"E131+F130","v":-5244843.8299841536},-3850773.4288057699,-2231973.5126693207,-488620.55078898021,1382222.2313683438]
[{"$f":"A131+A129","v":"2025-10-23T19:52:49.024"},"Period",null,{"$f":"COUNTIF(D131:J131,\"<\"&A128)","v":6},{"$f":"F132*12/10","v":3.7609448396554939},{"$f":"(A128-HLOOKUP(COUNTIF(D131:J131,\"<\"&A128),D129:J131, 3,0))/(HLOOKUP(COUNTIF(D131:J131,\"<\"&A128)+1,D129:J131,2,0))*12","v":3.1341206997129119}]
[null,null,null,null," Ê   "," Indicates the fraction of the year"]
[]
[]
[null,null,null,0.22900000000000001,0.1787,0.14219999999999999,6.5500000000000003E-2,1.9900000000000001E-2,1.9E-3,0,0,1.2E-2,6.4399999999999999E-2,0.08,0.2064,{"$f":"SUM(D136:O136)","v":1}]

{"sheet":"Bayes","index":3,"n_rows":48,"n_cols":16,"rows_kept":48,"cut":false,"hidden":false,"merged":[[47,0,49,0],[43,1,43,2],[43,3,43,4],[43,5,43,6],[15,6,15,8],[27,1,29,15],[43,7,44,15],[44,1,44,2],[44,5,44,6],[45,1,45,2],[39,1,41,15],[27,16,28,16],[29,16,30,16],[30,1,31,15],[33,10,35,15],[14,2,14,3],[14,6,14,8],[14,10,14,14],[15,13,15,14],[20,11,21,11],[22,16,23,16],[23,1,24,15],[24,16,25,16],[25,0,26,15],[0,1,0,4],[1,1,1,4],[10,5,12,15],[6,9,6,15],[7,9,7,15],[8,9,8,15],[8,5,8,8],[9,5,9,15],[10,0,10,1],[12,0,12,1],[1,0,2,0],[6,0,6,1],[8,0,8,1]]}
["CHAPTER 1 ","DECISION ANALYSIS",null,null,null,null,null,null,null,null,null,"Name of Project"]
["Level④","POSTERIOR PROBABILITIES OF TWO EVENTS",null,null,null,null,null,null,null,null,null,{"$f":"Intro!H5","v":"TomCuc Greenhouse"}]
[]
["Background:","You are producer and supplier of high quality vegetables to two salesmen on large nets of European wholesale markets. Let A1 and A2 denoted two events of interest—different quantiies for sales."]
["Historical Info: ","Enter new data below. If except these two events of interest there are more probabilities indicated by the Online Cash-Flow Control System, go to the next Sheet\u0086 \"Bayes5\" ."]
[]
[" Event A1: part of QUANTITY for Salesman A1 →",null,{"$f":"BUDGET!M75","v":0.67}," Percentage of prior probability for sale on the market.",null,null,null,null,null,"The mutually exclusive events for which posterior probabilities are desired."]
[null,null,null,null,null,null,null,null,null,"My events of interest:"]
[" Event A2: part of QUANTITY for Salesman A2 →",null,{"$f":"100%-C7","v":0.32999999999999996}," Percentage supplied to A2   I ",null,"→ low quality of commercial service - term → of deferred payment and lower income.",null,null,null,"Which of both market distributors sells our products             on the better prices and pays us faster?"]
[null,null,null,null,null,"In analyzing of conditional prior probability for specific events of interest here are indicated probabilities giving new information for their revision"]
[" Event A1:  QUALITY Good services for Salesman A1 →",null,{"$f":"BUDGET!L75/100","v":0.79}," Percentage Good sаlеs and payments (G)",null,"Based on pre-design marketing the values of prior conditional probabilities of professional ratings of the two salesmen and their markets are shown in the Table. This prior probability will be revised in light of new operational information Income streams when appear problems, what is the probability and what part is due to each Sales-man? The Joint Bad Probabilities are found by multiplying the prior probabilities by the Conditional Probabilities = equal to Overall probability of finding the Bad part of commercial outsourcing, and for further improvement."]
[]
[" Event A2:  QUALITY  Bad services for Salesman A2 →",null,{"$f":"BUDGET!N75/100","v":0.21}," Percentage Bad sаlеs and payment (B)"]
[]
["Safe Event",null,"SALES REVENUE EVENTS",null,"PRIOR PROBABILITY",null,"POSTERIOR",null,null,null,"TABULAR APPROACH"]
["Restore Model","When Yu pay - cry"," Percentage of total  Sаlеs","Percentage Bad QUALITY Sаlеs","QUANTITY % from A1∩A2 Sаlеs",null,"      PROBABILITIES         that Bad part of sales is:",null,null,null,"A1U A2 Prior Probabilities","B Conditional Probabilities","Joint  Bad A1, 2 ∩ B","Posterior Probabilities",null,"Others cry"]
[]
["Clean Model","Salesman A1",{"$f":"C7","v":0.67},{"$f":"1-C11","v":0.20999999999999996},{"$f":"C7","v":0.67},null,"From Salesman A1:",null,{"$f":"D18*E18/(D18*E18+D20*E20)","v":0.67},null,{"$f":"C18","v":0.67},{"$f":"D18","v":0.20999999999999996},{"$f":"K18*L18","v":0.14069999999999999},{"$f":"M18/M21","v":0.67}]
[]
[null,"Salesman A2",{"$f":"C9","v":0.32999999999999996},{"$f":"C13","v":0.21},{"$f":"1-E18","v":0.32999999999999996},null,"From Salesman A2:",null,{"$f":"D20*E20/(D18*E18+D20*E20)","v":0.33},null,{"$f":"C20","v":0.32999999999999996},{"$f":"D20","v":0.21},{"$f":"K20*L20","v":6.9299999999999987E-2},{"$f":"M20/M21","v":0.33}]
["ANALYSIS:","On relative basis: the probability of the Bad event, coming from Salesman А2 [",null,null,null,{"$f":"N20","v":0.33},"] compared [",{"$f":"N18","v":0.67},"] from Good A1.",null,{"$f":"K18+K20","v":1},"To the new  info given each event",{"$f":"SUM(M18:M20)","v":0.20999999999999996},{"$f":"N18+N20","v":1},null,{"$f":"M21*10+O21*1","v":2.0999999999999996}]
[null,"There is a greater likelihood Bad event to be observed because outcome as [ ",null,null,null,{"$f":"M20","v":6.9299999999999987E-2},"] following  [",{"$f":"N20","v":0.33},"] A2 Bad event could be a crash.",null,null,null,"Overall <probability of Bad event="]
[]
["CLOSING:"]
[]
["       Constructed using \"Quantitative Methods for Business\" (Fifth edition); David R. Anderson, University of Cincinnati, Dennis J. Sweeney, University of Cincinnati, Thomas A. Williams, Rochester Institute of Technology; Library of Congress Cataloging-in-Publication Data."]
[]
["COMMENTS:","It is well known and certainly recommendable that to start an investment project, the investor (and his team making inside risk assessment) must be convinced, must believe in the good outcome, and he must act decisively, without any hesitation. Very often, this is reflected in a low assessment of the Default Risk Ratio (d--Factor) that is raising its real impact. In such cases we approach the above probability estimation, often called “what-if” analysis. It follows the High Qualified Audit, in this Risk Assessment program recognized as \"Group D\"."]
[]
[]
[null,"Excerpts from the comments of our clients of this model: \". . . default risk assessment is the starting point which most frequently cause disputes with the lenders, very often ending with denial of funding, no matter what the finally stated reason was.\" Look at the picture below, which is the most popular example of visible illusion.\n\n\n"]
[]
[]
[null,null," We are looking out to the market and don’t see a big risk to become unable to pay back our debt.",null,null,null,null,null,null,null,"Who is right, when the lengths of the lines are equal? . . . \""]
[]
[null,null,"        The lenders are only looking within themselves, see plenty of big risks, and talk only about it."]
[]
[null,"In making a decision for new investments never believe and rely solely on: ① your intuition, based on long-term experience; ② suggestions of high level experts; and ③ good chance."]
[null,"Rely only on risk assessment and computing of prior and posterior probability of specific events of interest. Once you have them, return to the above approaches for the final decision."]
[null,"The assessment of Default Risk (d ) to an acceptable level is a key factor for the positive resolution of a loan application. The system, called OCFCS for short, which we recommend is an instrument that serves post factum an investment throughout the project providing permanent online information to the lender, insurer and to the investor."]
[]
[]
[]
["RECORD:","PROJECT NAME",null,"QUALITY",null,"QUANTITY",null,"The event . . . "]
[null,"(or Investor Name)",null,"AGENT A1","AGENT A2","AGENT A1"]
[null,{"$f":"L2","v":"TomCuc Greenhouse"},null,0.98,0.95,null,0.65,"Agents distribute in their countries these percentages of KEM's products."]
[]
["Keep  these h cells free for longer project name extension"]

{"sheet":"Staff","index":4,"n_rows":43,"n_cols":12,"rows_kept":43,"cut":false,"hidden":false,"merged":[[6,4,7,5],[16,9,17,9],[0,9,1,9],[0,8,1,8],[15,7,15,8],[5,7,5,8],[6,9,7,9],[7,7,7,8],[17,7,17,8]]}
[null,null,null,"лв./$ exchange rate:",1,1.52,null,null,{"$f":"Intro!C83","v":5.8368000000000002},"Area "]
[null,null,null,"USD/EUR exchange rate:",1,1.05]
[null,null,null,"EUR/лв. exchange rate:",1,1.96,null,null,null,null,null,"Supporting Column"]
[]
[null,null,"OCFCS & Trading Consulting Company",null,null,"STAFF - Start Salaries"]
[null,null,null,"PERSONNEL, Position","%","€ p.Мо","p.ann","€ p.Mo",null,0]
[null,null,null,null,"Remuneration",null,null,"₊Bonus"]
[null,null,null,"WORKING ТЕАМ",null,null,null,"(conditional)"]
[null,null,1,"Manager",0.5,1000,{"$f":"E9*F9*$J$16","v":6000},100,{"$f":"E9*(F9+G9)","v":3500},{"$f":"E9*I9*$J$6","v":0}]
[null,null,{"$f":"C9+1","v":2},"Expert risk management",0.5,600,{"$f":"E10*F10*$J$16","v":3600},75,0,{"$f":"I10*$J$6","v":0}]
[null,null,{"$f":"C10+1","v":3},"Expert financial control",0.5,600,3600,50,0,{"$f":"I11*$J$6","v":0}]
[null,null,null,"TOTAL:",{"$f":"E8","v":0},null,{"$f":"SUM(G9:G11)","v":13200},null,null,{"$f":"SUM(J9:J11)","v":0}]
[]
[]
[null,null,"Project Company TomCuC, Ltd.",null,null,"STAFF - Start Salaries"]
[null,null,null,"PERSONNEL, Position","Nr","€ p.Мо","p.ann","€ p.Mo",null,12]
[null,null,null,null,null,"Base salary","Fixed","₊Bonus","TOTAL"]
[null,null,null,"ASMINISTRATION",{"$f":"SUM(E19:E22)","v":6},"salary","salary","(conditional)"]
[null,null,1,"CEO - Manager",1,1000,{"$f":"E19*F19*$J$16","v":12000},300,{"$f":"F19+H19","v":1300},{"$f":"E19*I19*$J$16","v":15600}]
[null,null,{"$f":"C19+1","v":2},"Senior level technicans",2,800,{"$f":"E20*F20*$J$16","v":19200},200,{"$f":"F20+H20","v":1000},{"$f":"E20*I20*$J$16","v":24000}]
[null,null,{"$f":"C20+1","v":3},"Mid-level tehnicans",2,400,{"$f":"E21*F21*$J$16","v":9600},100,{"$f":"F21+H21","v":500},{"$f":"E21*I21*$J$16","v":12000}]
[null,null,{"$f":"C21+1","v":4},"Accountant",1,500,{"$f":"E22*F22*$J$16","v":6000},50,{"$f":"F22+H22","v":550},{"$f":"E22*I22*$J$16","v":6600}]
[null,null,null,"SERVICE STAFF",{"$f":"SUM(E24:E25)","v":5}]
[null,null,{"$f":"C22+1","v":5},"Truckers",1,500,{"$f":"E24*F24*$J$16","v":6000},50,{"$f":"F24+H24","v":550},{"$f":"E24*I24*$J$16","v":6600}]
[null,null,{"$f":"C24+1","v":6},"Security",4,400,{"$f":"E25*F25*$J$16","v":19200},0,{"$f":"F25+H25","v":400},{"$f":"E25*I25*$J$16","v":19200}]
[null,null,null,"SubTOTAL:",{"$f":"E18+E23","v":11},null,{"$f":"SUM(G19:G25)","v":72000},null,null,{"$f":"SUM(J19:J25)","v":84000}]
[]
[null,null,90,"PRODUCTION STAFF",{"$f":"E29","v":45}]
[null,null,7,"Payroll staff, p Mo",{"$f":"IF(AND($I$1>=10,C28>0),C28,IF(OR($I$1>=3,$I$1<=6),C28*1/2,IF(OR($I$1>=1,$I$1<3),30,0)))","v":45},400,{"$f":"E29*F29*$J$16","v":216000},100,{"$f":"F29+H29","v":500},{"$f":"E29*I29*$J$16","v":270000}]
[null,null,null,"Social Security (averaged)",null,null,{"$f":"G29*I30","v":37800},null,{"$f":"I37","v":0.17499999999999999},{"$f":"I30*J29","v":47250}]
[null,null,null,"SubTOTAL:",null,null,{"$f":"G29+G30","v":253800},null,null,{"$f":"SUM(J29:J30)","v":317250}]
[]
[null,null,null,"TomCuC HH, Ltd., TOTAL:",{"$f":"E26+E28","v":56},null,null,null,null,{"$f":"J26+J29","v":354000}]
[]
[]
[]
[null,null,null,"Social Security (averaged)",null,null,null,null,0.17499999999999999,{"$f":"I37*(J12+J26)","v":14699.999999999998}]
[null,null,null,"TOTAL:",null,null,null,null,null,{"$f":"J12+J33+J37","v":368700}]
[]
[]
[null,null,"*","Consequence of the need of Effective System of Internal Control during the repayment period."]
[null,null,null,"It must have to this position special Assignment of Responsibilities combining virtual treasurer and controller."]
[null,null,null,"He should have Limited Proper Authorization during the loan repayment period only."]

{"sheet":"Bayes5","index":5,"n_rows":20,"n_cols":16,"rows_kept":20,"cut":false,"hidden":false,"merged":[[10,14,10,17],[1,1,1,8],[6,14,6,17],[7,14,7,17],[8,14,8,17],[9,14,9,17],[17,14,17,17],[11,14,11,17],[12,14,12,17],[13,14,13,17],[14,14,14,17],[15,14,15,17],[16,14,16,17]]}
["CHAPTER 1 ",null,null,null,null,"DECEISION ANALYSES",null,null,null,null,null,null,null,null,null,"Name of Project"]
[null,"POSTERIOR PROBABILITIES OF FIVE EVENTS",null,null,null,null,null,null,null,null,null,null,null,null,null,{"$f":"'Cap.Goods'!E3","v":"Zoom 152        Capital Goods and Services "}]
[]
["Background:","Five mutually exclusive events following delivery of goods or services by Suppliers  where one of the events must occur when new information"]
["Clean and Start","from a sample, a special report, a product test, and so on, about it is received. Henceforth, you have to revise or update the prior probability values."]
["Historical Info: ","Good quality event \u0088  ENTER",null,null,null,null,null,"Complete here\u0088  the here Bad parts or services received from each supplier . "]
[null,null,"QUALITY",null,null,null,"QUANTITY",null,"POSTERIOR PROBABILITY",null,"CONDITIONAL",null,"FINAL",null,"NOTES"]
[null,null,"% Good",null,"% Bad",null,"% from",null,"that Bad event is:",null,"Joint  Bad A1,2 ∩B",null,"for Ai"]
[" Event A1 from:","Supplier A1 (Subcontractor)",null,null,{"$f":"1-C9","v":1},null,null,null,{"$f":"100*E9*G9/($E$9*$G$9+$E$11*$G$11+$E$13*$G$13+$E$15*$G$15+$E$17*$G$17)","v":0},null,{"$f":"100*G9*E9","v":0},null,{"$f":"K9/$K$19","v":0}]
[]
[" Event A2 from:","Supplier A2 (Subcontractor)",null,null,{"$f":"1-C11","v":1},null,null,null,{"$f":"100*E11*G11/($E$9*$G$9+$E$11*$G$11+$E$13*$G$13+$E$15*$G$15+$E$17*$G$17)","v":0},null,{"$f":"100*G11*E11","v":0},null,{"$f":"K11/$K$19","v":0}]
[]
[" Event A3 from:","Supplier A3  (Subcontractor)",null,null,{"$f":"1-C13","v":1},null,null,null,{"$f":"100*E13*G13/($E$9*$G$9+$E$11*$G$11+$E$13*$G$13+$E$15*$G$15+$E$17*$G$17)","v":0},null,{"$f":"100*G13*E13","v":0},null,{"$f":"K13/$K$19","v":0}]
[]
[" Event A4 from:","Supplier A4 (Subcontractor)",null,null,{"$f":"1-C15","v":1},null,null,null,{"$f":"100*E15*G15/($E$9*$G$9+$E$11*$G$11+$E$13*$G$13+$E$15*$G$15+$E$17*$G$17)","v":0},null,{"$f":"100*G15*E15","v":0},null,{"$f":"K15/$K$19","v":0}]
[]
[" Event A5 from:","Supplier A5  (Subcontractor)",null,null,{"$f":"1-C17","v":1},null,{"$f":"1-SUM(G9:G15)","v":1},null,{"$f":"100*E17*G17/($E$9*$G$9+$E$11*$G$11+$E$13*$G$13+$E$15*$G$15+$E$17*$G$17)","v":100},null,{"$f":"100*G17*E17","v":100},null,{"$f":"K17/$K$19","v":1}]
[]
["See Comments",null,null,null,null,null,null,null,null,null,{"$f":"SUM(K9:K18)","v":100},null,{"$f":"SUM(M9:M18)","v":1}]
[null,null,null,null,null,null,null,null,null,null,"Overall<probability of happen Bad event"]